BDBM50105376 (S)-2-{[(S)-1-(3,5-Dichloro-benzenesulfonyl)-2-methyl-pyrrolidine-2-carbonyl]-amino}-3-(2'-methylsulfanyl-biphenyl-4-yl)-propionic acid::CHEMBL91109
SMILES: CSc1ccccc1-c1ccc(C[C@H](NC(=O)[C@]2(C)CCCN2S(=O)(=O)c2cc(Cl)cc(Cl)c2)C(O)=O)cc1
InChI Key: InChIKey=SATRONDTGPPWOY-CUBQBAPOSA-N
Data: 2 IC50
Activity Spreadsheet -- Enzyme Inhibition Constant Data from BindingDB
Found 2 hits for monomerid = 50105376
Trg + Lig
Ki
nM
ΔG°
kcal/mole
IC50
nM
Kd
nM
EC50/IC50
nM
koff
s-1
kon
M-1s-1
pHTemp
°C
Fibronectin receptor beta/Integrin alpha-4
(Homo sapiens (Human))
BDBM50105376
((S)-2-{[(S)-1-(3,5-Dichloro-benzenesulfonyl)-2-met...)
Show SMILES CSc1ccccc1-c1ccc(C[C@H](NC(=O)[C@]2(C)CCCN2S(=O)(=O)c2cc(Cl)cc(Cl)c2)C(O)=O)cc1
Show InChI InChI=1S/C28H28Cl2N2O5S2/c1-28(12-5-13-32(28)39(36,37)22-16-20(29)15-21(30)17-22)27(35)31-24(26(33)34)14-18-8-10-19(11-9-18)23-6-3-4-7-25(23)38-2/h3-4,6-11,15-17,24H,5,12-14H2,1-2H3,(H,31,35)(H,33,34)/t24-,28-/m0/s1
Reactome pathway
n/an/a 0.650n/an/an/an/an/an/a
Merck Research Laboratories
Curated by ChEMBL
Assay Description
Antagonistic activity against VLA-4 integrin of human jurkat cells using [125I]VCAM-Ig as radioligand
Bioorg Med Chem Lett 11: 2709-13 (2001)
BindingDB Entry DOI: 10.7270/Q22Z14V4
Integrin α4β7
(Homo sapiens (Human))
BDBM50105376
((S)-2-{[(S)-1-(3,5-Dichloro-benzenesulfonyl)-2-met...)
Show SMILES CSc1ccccc1-c1ccc(C[C@H](NC(=O)[C@]2(C)CCCN2S(=O)(=O)c2cc(Cl)cc(Cl)c2)C(O)=O)cc1
Show InChI InChI=1S/C28H28Cl2N2O5S2/c1-28(12-5-13-32(28)39(36,37)22-16-20(29)15-21(30)17-22)27(35)31-24(26(33)34)14-18-8-10-19(11-9-18)23-6-3-4-7-25(23)38-2/h3-4,6-11,15-17,24H,5,12-14H2,1-2H3,(H,31,35)(H,33,34)/t24-,28-/m0/s1
NCI pathway
Reactome pathway
n/an/a 78n/an/an/an/an/an/a
Merck Research Laboratories
Curated by ChEMBL
Assay Description
Antagonistic activity against VLA-4 integrin of human jurkat cells using [125I]VCAM-Ig as radioligand
Bioorg Med Chem Lett 11: 2709-13 (2001)
BindingDB Entry DOI: 10.7270/Q22Z14V4