BDBM50105383 (S)-2-{[(S)-1-(3,5-Dichloro-benzenesulfonyl)-2-methyl-pyrrolidine-2-carbonyl]-amino}-3-(4-pyridin-3-yl-phenyl)-propionic acid::CHEMBL94107
SMILES: C[C@]1(CCCN1S(=O)(=O)c1cc(Cl)cc(Cl)c1)C(=O)N[C@@H](Cc1ccc(cc1)-c1cccnc1)C(O)=O
InChI Key: InChIKey=GDSMXSYVAAVCRV-OZXSUGGESA-N
Data: 2 IC50
Activity Spreadsheet -- Enzyme Inhibition Constant Data from BindingDB
Found 2 hits for monomerid = 50105383
Trg + Lig
Ki
nM
ΔG°
kcal/mole
IC50
nM
Kd
nM
EC50/IC50
nM
koff
s-1
kon
M-1s-1
pHTemp
°C
Fibronectin receptor beta/Integrin alpha-4
(Homo sapiens (Human))
BDBM50105383
((S)-2-{[(S)-1-(3,5-Dichloro-benzenesulfonyl)-2-met...)
Show SMILES C[C@]1(CCCN1S(=O)(=O)c1cc(Cl)cc(Cl)c1)C(=O)N[C@@H](Cc1ccc(cc1)-c1cccnc1)C(O)=O
Show InChI InChI=1S/C26H25Cl2N3O5S/c1-26(9-3-11-31(26)37(35,36)22-14-20(27)13-21(28)15-22)25(34)30-23(24(32)33)12-17-5-7-18(8-6-17)19-4-2-10-29-16-19/h2,4-8,10,13-16,23H,3,9,11-12H2,1H3,(H,30,34)(H,32,33)/t23-,26-/m0/s1
Reactome pathway
n/an/a 0.350n/an/an/an/an/an/a
Merck Research Laboratories
Curated by ChEMBL
Assay Description
Antagonistic activity against VLA-4 integrin of human jurkat cells using [125I]VCAM-Ig as radioligand
Bioorg Med Chem Lett 11: 2709-13 (2001)
BindingDB Entry DOI: 10.7270/Q22Z14V4
Integrin α4β7
(Homo sapiens (Human))
BDBM50105383
((S)-2-{[(S)-1-(3,5-Dichloro-benzenesulfonyl)-2-met...)
Show SMILES C[C@]1(CCCN1S(=O)(=O)c1cc(Cl)cc(Cl)c1)C(=O)N[C@@H](Cc1ccc(cc1)-c1cccnc1)C(O)=O
Show InChI InChI=1S/C26H25Cl2N3O5S/c1-26(9-3-11-31(26)37(35,36)22-14-20(27)13-21(28)15-22)25(34)30-23(24(32)33)12-17-5-7-18(8-6-17)19-4-2-10-29-16-19/h2,4-8,10,13-16,23H,3,9,11-12H2,1H3,(H,30,34)(H,32,33)/t23-,26-/m0/s1
NCI pathway
Reactome pathway
n/an/a 311n/an/an/an/an/an/a
Merck Research Laboratories
Curated by ChEMBL
Assay Description
Inhibition of [125I]VCAM-Ig binding to alpha4-beta7 integrin of human RPMI-8866 cells
Bioorg Med Chem Lett 11: 2709-13 (2001)
BindingDB Entry DOI: 10.7270/Q22Z14V4