null
SMILES: COc1cccnc1-c1ccc(C[C@H](NC(=O)[C@]2(C)CCCN2S(=O)(=O)c2cc(Cl)cc(Cl)c2)C(O)=O)cc1
InChI Key: InChIKey=KFNKHVGWGQDFPY-CUNXSJBXSA-N
Activity Spreadsheet -- Enzyme Inhibition Constant Data from BindingDB
Found 2 hits for monomerid = 50105394
Trg + Lig
Ki
nM
ΔG°
kcal/mole
IC50
nM
Kd
nM
EC50/IC50
nM
koff
s-1
kon
M-1s-1
pHTemp
°C
Integrin alpha-4/beta-7
(Homo sapiens (Human))
BDBM50105394
((S)-2-{[(S)-1-(3,5-Dichloro-benzenesulfonyl)-2-met...)
Show SMILES COc1cccnc1-c1ccc(C[C@H](NC(=O)[C@]2(C)CCCN2S(=O)(=O)c2cc(Cl)cc(Cl)c2)C(O)=O)cc1
Show InChI InChI=1S/C27H27Cl2N3O6S/c1-27(10-4-12-32(27)39(36,37)21-15-19(28)14-20(29)16-21)26(35)31-22(25(33)34)13-17-6-8-18(9-7-17)24-23(38-2)5-3-11-30-24/h3,5-9,11,14-16,22H,4,10,12-13H2,1-2H3,(H,31,35)(H,33,34)/t22-,27-/m0/s1
n/an/a 53n/an/an/an/an/an/a
Merck Research Laboratories
Curated by ChEMBL
Assay Description
Inhibition of [125I]MAdCAM-Ig binding to alpha4-beta7 integrin of human RPMI-8866 cells
Bioorg Med Chem Lett 11: 2709-13 (2001)
BindingDB Entry DOI: 10.7270/Q22Z14V4
Integrin alpha-4/beta-1
(Homo sapiens (Human))
BDBM50105394
((S)-2-{[(S)-1-(3,5-Dichloro-benzenesulfonyl)-2-met...)
Show SMILES COc1cccnc1-c1ccc(C[C@H](NC(=O)[C@]2(C)CCCN2S(=O)(=O)c2cc(Cl)cc(Cl)c2)C(O)=O)cc1
Show InChI InChI=1S/C27H27Cl2N3O6S/c1-27(10-4-12-32(27)39(36,37)21-15-19(28)14-20(29)16-21)26(35)31-22(25(33)34)13-17-6-8-18(9-7-17)24-23(38-2)5-3-11-30-24/h3,5-9,11,14-16,22H,4,10,12-13H2,1-2H3,(H,31,35)(H,33,34)/t22-,27-/m0/s1
Reactome pathway
n/an/a 0.110n/an/an/an/an/an/a
Merck Research Laboratories
Curated by ChEMBL
Assay Description
Antagonistic activity against VLA-4 integrin of human jurkat cells using [125I]VCAM-Ig as radioligand
Bioorg Med Chem Lett 11: 2709-13 (2001)
BindingDB Entry DOI: 10.7270/Q22Z14V4