BDBM50105404 (S)-2-{[(S)-1-(3,5-Dichloro-benzenesulfonyl)-pyrrolidine-2-carbonyl]-amino}-3-(2'-fluoro-biphenyl-4-yl)-propionic acid::CHEMBL92106
SMILES: OC(=O)[C@H](Cc1ccc(cc1)-c1ccccc1F)NC(=O)[C@@H]1CCCN1S(=O)(=O)c1cc(Cl)cc(Cl)c1
InChI Key: InChIKey=PWMAEWNRSJGUGQ-ZEQRLZLVSA-N
Data: 1 IC50
Activity Spreadsheet -- Enzyme Inhibition Constant Data from BindingDB
Found 1 hit for monomerid = 50105404
Trg + Lig
Ki
nM
ΔG°
kcal/mole
IC50
nM
Kd
nM
EC50/IC50
nM
koff
s-1
kon
M-1s-1
pHTemp
°C
Fibronectin receptor beta/Integrin alpha-4
(Homo sapiens (Human))
BDBM50105404
((S)-2-{[(S)-1-(3,5-Dichloro-benzenesulfonyl)-pyrro...)
Show SMILES OC(=O)[C@H](Cc1ccc(cc1)-c1ccccc1F)NC(=O)[C@@H]1CCCN1S(=O)(=O)c1cc(Cl)cc(Cl)c1
Show InChI InChI=1S/C26H23Cl2FN2O5S/c27-18-13-19(28)15-20(14-18)37(35,36)31-11-3-6-24(31)25(32)30-23(26(33)34)12-16-7-9-17(10-8-16)21-4-1-2-5-22(21)29/h1-2,4-5,7-10,13-15,23-24H,3,6,11-12H2,(H,30,32)(H,33,34)/t23-,24-/m0/s1
Reactome pathway
n/an/a 1n/an/an/an/an/an/a
Merck Research Laboratories
Curated by ChEMBL
Assay Description
Antagonistic activity against VLA-4 integrin of human jurkat cells using [125I]VCAM-Ig as radioligand
Bioorg Med Chem Lett 11: 2709-13 (2001)
BindingDB Entry DOI: 10.7270/Q22Z14V4