BDBM50105405 4'-((S)-2-Carboxy-2-{[(S)-1-(3,5-dichloro-benzenesulfonyl)-pyrrolidine-2-carbonyl]-amino}-ethyl)-biphenyl-3-carboxylic acid methyl ester::CHEMBL91572
SMILES: COC(=O)c1cccc(c1)-c1ccc(C[C@H](NC(=O)[C@@H]2CCCN2S(=O)(=O)c2cc(Cl)cc(Cl)c2)C(O)=O)cc1
InChI Key: InChIKey=HLDVFPCKENBYRZ-DQEYMECFSA-N
Data: 1 IC50
Activity Spreadsheet -- Enzyme Inhibition Constant Data from BindingDB
Found 1 hit for monomerid = 50105405
Trg + Lig
Ki
nM
ΔG°
kcal/mole
IC50
nM
Kd
nM
EC50/IC50
nM
koff
s-1
kon
M-1s-1
pHTemp
°C
Fibronectin receptor beta/Integrin alpha-4
(Homo sapiens (Human))
BDBM50105405
(4'-((S)-2-Carboxy-2-{[(S)-1-(3,5-dichloro-benzenes...)
Show SMILES COC(=O)c1cccc(c1)-c1ccc(C[C@H](NC(=O)[C@@H]2CCCN2S(=O)(=O)c2cc(Cl)cc(Cl)c2)C(O)=O)cc1
Show InChI InChI=1S/C28H26Cl2N2O7S/c1-39-28(36)20-5-2-4-19(13-20)18-9-7-17(8-10-18)12-24(27(34)35)31-26(33)25-6-3-11-32(25)40(37,38)23-15-21(29)14-22(30)16-23/h2,4-5,7-10,13-16,24-25H,3,6,11-12H2,1H3,(H,31,33)(H,34,35)/t24-,25-/m0/s1
Reactome pathway
n/an/a 0.400n/an/an/an/an/an/a
Merck Research Laboratories
Curated by ChEMBL
Assay Description
Antagonistic activity against VLA-4 integrin of human jurkat cells using [125I]VCAM-Ig as radioligand
Bioorg Med Chem Lett 11: 2709-13 (2001)
BindingDB Entry DOI: 10.7270/Q22Z14V4