BDBM50105407 (S)-2-{[(S)-1-(3,5-Dichloro-benzenesulfonyl)-pyrrolidine-2-carbonyl]-amino}-3-(4'-methyl-biphenyl-4-yl)-propionic acid::CHEMBL329356
SMILES: Cc1ccc(cc1)-c1ccc(C[C@H](NC(=O)[C@@H]2CCCN2S(=O)(=O)c2cc(Cl)cc(Cl)c2)C(O)=O)cc1
InChI Key: InChIKey=QGKYFEGJAYKPGL-DQEYMECFSA-N
Data: 1 IC50
Activity Spreadsheet -- Enzyme Inhibition Constant Data from BindingDB
Found 1 hit for monomerid = 50105407
Trg + Lig
Ki
nM
ΔG°
kcal/mole
IC50
nM
Kd
nM
EC50/IC50
nM
koff
s-1
kon
M-1s-1
pHTemp
°C
Fibronectin receptor beta/Integrin alpha-4
(Homo sapiens (Human))
BDBM50105407
((S)-2-{[(S)-1-(3,5-Dichloro-benzenesulfonyl)-pyrro...)
Show SMILES Cc1ccc(cc1)-c1ccc(C[C@H](NC(=O)[C@@H]2CCCN2S(=O)(=O)c2cc(Cl)cc(Cl)c2)C(O)=O)cc1
Show InChI InChI=1S/C27H26Cl2N2O5S/c1-17-4-8-19(9-5-17)20-10-6-18(7-11-20)13-24(27(33)34)30-26(32)25-3-2-12-31(25)37(35,36)23-15-21(28)14-22(29)16-23/h4-11,14-16,24-25H,2-3,12-13H2,1H3,(H,30,32)(H,33,34)/t24-,25-/m0/s1
Reactome pathway
n/an/a 1.5n/an/an/an/an/an/a
Merck Research Laboratories
Curated by ChEMBL
Assay Description
Antagonistic activity against VLA-4 integrin of human jurkat cells using [125I]VCAM-Ig as radioligand
Bioorg Med Chem Lett 11: 2709-13 (2001)
BindingDB Entry DOI: 10.7270/Q22Z14V4