null
SMILES: CNC(=O)c1ccccc1-c1ccc(C[C@H](NC(=O)[C@@H]2CCCN2S(=O)(=O)c2cc(Cl)cc(Cl)c2)C(O)=O)cc1
InChI Key: InChIKey=RZDYGMVWRQQDRU-DQEYMECFSA-N
Activity Spreadsheet -- Enzyme Inhibition Constant Data from BindingDB
Found 1 hit for monomerid = 50105408
Trg + Lig
Ki
nM
ΔG°
kcal/mole
IC50
nM
Kd
nM
EC50/IC50
nM
koff
s-1
kon
M-1s-1
pHTemp
°C
Integrin alpha-4/beta-1
(Homo sapiens (Human))
BDBM50105408
((S)-2-{[(S)-1-(3,5-Dichloro-benzenesulfonyl)-pyrro...)
Show SMILES CNC(=O)c1ccccc1-c1ccc(C[C@H](NC(=O)[C@@H]2CCCN2S(=O)(=O)c2cc(Cl)cc(Cl)c2)C(O)=O)cc1
Show InChI InChI=1S/C28H27Cl2N3O6S/c1-31-26(34)23-6-3-2-5-22(23)18-10-8-17(9-11-18)13-24(28(36)37)32-27(35)25-7-4-12-33(25)40(38,39)21-15-19(29)14-20(30)16-21/h2-3,5-6,8-11,14-16,24-25H,4,7,12-13H2,1H3,(H,31,34)(H,32,35)(H,36,37)/t24-,25-/m0/s1
Reactome pathway
n/an/a 0.100n/an/an/an/an/an/a
Merck Research Laboratories
Curated by ChEMBL
Assay Description
Antagonistic activity against VLA-4 integrin of human jurkat cells using [125I]VCAM-Ig as radioligand
Bioorg Med Chem Lett 11: 2709-13 (2001)
BindingDB Entry DOI: 10.7270/Q22Z14V4