BDBM50105412 (S)-2-{[(S)-1-(3,5-Dichloro-benzenesulfonyl)-pyrrolidine-2-carbonyl]-amino}-3-(4'-formyl-biphenyl-4-yl)-propionic acid::CHEMBL328890
SMILES: OC(=O)[C@H](Cc1ccc(cc1)-c1ccc(C=O)cc1)NC(=O)[C@@H]1CCCN1S(=O)(=O)c1cc(Cl)cc(Cl)c1
InChI Key: InChIKey=GRIXHDLHYDUGHP-DQEYMECFSA-N
Data: 1 IC50
Activity Spreadsheet -- Enzyme Inhibition Constant Data from BindingDB
Found 1 hit for monomerid = 50105412
Trg + Lig
Ki
nM
ΔG°
kcal/mole
IC50
nM
Kd
nM
EC50/IC50
nM
koff
s-1
kon
M-1s-1
pHTemp
°C
Fibronectin receptor beta/Integrin alpha-4
(Homo sapiens (Human))
BDBM50105412
((S)-2-{[(S)-1-(3,5-Dichloro-benzenesulfonyl)-pyrro...)
Show SMILES OC(=O)[C@H](Cc1ccc(cc1)-c1ccc(C=O)cc1)NC(=O)[C@@H]1CCCN1S(=O)(=O)c1cc(Cl)cc(Cl)c1
Show InChI InChI=1S/C27H24Cl2N2O6S/c28-21-13-22(29)15-23(14-21)38(36,37)31-11-1-2-25(31)26(33)30-24(27(34)35)12-17-3-7-19(8-4-17)20-9-5-18(16-32)6-10-20/h3-10,13-16,24-25H,1-2,11-12H2,(H,30,33)(H,34,35)/t24-,25-/m0/s1
Reactome pathway
n/an/a 0.380n/an/an/an/an/an/a
Merck Research Laboratories
Curated by ChEMBL
Assay Description
Antagonistic activity against VLA-4 integrin of human jurkat cells using [125I]VCAM-Ig as radioligand
Bioorg Med Chem Lett 11: 2709-13 (2001)
BindingDB Entry DOI: 10.7270/Q22Z14V4