BDBM50105589 2,3,4-Trihydroxy-benzoic acid 5,7-dihydroxy-chroman-3-yl ester::CHEMBL328046
SMILES: Oc1cc(O)c2CC(COc2c1)OC(=O)c1ccc(O)c(O)c1O
InChI Key: InChIKey=RVRYIACZCYIFON-UHFFFAOYSA-N
Data: 2 IC50
Activity Spreadsheet -- Enzyme Inhibition Constant Data from BindingDB
Found 2 hits for monomerid = 50105589
Trg + Lig
Ki
nM
ΔG°
kcal/mole
IC50
nM
Kd
nM
EC50/IC50
nM
koff
s-1
kon
M-1s-1
pHTemp
°C
Human immunodeficiency virus type 1 reverse transcriptase
(Human immunodeficiency virus 1)
BDBM50105589
(2,3,4-Trihydroxy-benzoic acid 5,7-dihydroxy-chroma...)
Show SMILES Oc1cc(O)c2CC(COc2c1)OC(=O)c1ccc(O)c(O)c1O
Show InChI InChI=1S/C16H14O8/c17-7-3-12(19)10-5-8(6-23-13(10)4-7)24-16(22)9-1-2-11(18)15(21)14(9)20/h1-4,8,17-21H,5-6H2
n/an/a 3.83E+3n/an/an/an/an/an/a
University of Toledo
Curated by ChEMBL
Assay Description
Inhibition of polymerization in wild type HIV-1 RT with poly rC/dG12-18 template primer and [3H]dGTP
Bioorg Med Chem Lett 11: 2763-7 (2001)
BindingDB Entry DOI: 10.7270/Q2X92BTR
Human immunodeficiency virus type 1 protease
(Human immunodeficiency virus type 1)
BDBM50105589
(2,3,4-Trihydroxy-benzoic acid 5,7-dihydroxy-chroma...)
Show SMILES Oc1cc(O)c2CC(COc2c1)OC(=O)c1ccc(O)c(O)c1O
Show InChI InChI=1S/C16H14O8/c17-7-3-12(19)10-5-8(6-23-13(10)4-7)24-16(22)9-1-2-11(18)15(21)14(9)20/h1-4,8,17-21H,5-6H2
n/an/a 2.36E+3n/an/an/an/an/an/a
University of Toledo
Curated by ChEMBL
Assay Description
Inhibitory concentration against polymerization in A17 double mutant HIV-1 RT using a template primer of poly rC/dG12-18 and [3H]dGTP
Bioorg Med Chem Lett 11: 2763-7 (2001)
BindingDB Entry DOI: 10.7270/Q2X92BTR