BDBM50105598 5-tert-Butyl-3-[3-(1-ethyl-1H-pyrrol-3-yl)-ureido]-thiophene-2-carboxylic acid methyl ester::CHEMBL93264::methyl 5-tert-butyl-3-(3-(1-ethyl-1H-pyrrol-3-yl)ureido)thiophene-2-carboxylate
SMILES: CCn1ccc(NC(=O)Nc2cc(sc2C(=O)OC)C(C)(C)C)c1
InChI Key: InChIKey=NODOOVCFKLFCGG-UHFFFAOYSA-N
Data: 2 IC50
Activity Spreadsheet -- Enzyme Inhibition Constant Data from BindingDB
Found 2 hits for monomerid = 50105598
Trg + Lig
Ki
nM
ΔG°
kcal/mole
IC50
nM
Kd
nM
EC50/IC50
nM
koff
s-1
kon
M-1s-1
pHTemp
°C
RAF proto-oncogene serine/threonine-protein kinase
(Homo sapiens (Human))
BDBM50105598
(5-tert-Butyl-3-[3-(1-ethyl-1H-pyrrol-3-yl)-ureido]...)
Show SMILES CCn1ccc(NC(=O)Nc2cc(sc2C(=O)OC)C(C)(C)C)c1
Show InChI InChI=1S/C17H23N3O3S/c1-6-20-8-7-11(10-20)18-16(22)19-12-9-13(17(2,3)4)24-14(12)15(21)23-5/h7-10H,6H2,1-5H3,(H2,18,19,22)
NCI pathway
Reactome pathway
n/an/a 7.60E+3n/an/an/an/an/an/a
Bayer Research Center
Curated by ChEMBL
Assay Description
Inhibitory concentration against raf kinase.
Bioorg Med Chem Lett 11: 2775-8 (2001)
BindingDB Entry DOI: 10.7270/Q2NS0VD5
RAF proto-oncogene serine/threonine-protein kinase
(Homo sapiens (Human))
BDBM50105598
(5-tert-Butyl-3-[3-(1-ethyl-1H-pyrrol-3-yl)-ureido]...)
Show SMILES CCn1ccc(NC(=O)Nc2cc(sc2C(=O)OC)C(C)(C)C)c1
Show InChI InChI=1S/C17H23N3O3S/c1-6-20-8-7-11(10-20)18-16(22)19-12-9-13(17(2,3)4)24-14(12)15(21)23-5/h7-10H,6H2,1-5H3,(H2,18,19,22)
NCI pathway
Reactome pathway
n/an/a 7.60E+3n/an/an/an/an/an/a
China Pharmaceutical University
Curated by ChEMBL
Assay Description
Inhibition of B-Raf1 (unknown origin)
Eur J Med Chem 44: 1240-9 (2009)
Article DOI: 10.1016/j.ejmech.2008.09.016
BindingDB Entry DOI: 10.7270/Q28G8KJ5