BDBM50105808 3'-Nitro-biphenyl-4-sulfonic acid (3-hydroxy-propyl)-(2-phenyl-2H-pyrazol-3-yl)-amide::CHEMBL121522
SMILES: OCCCN(c1ccnn1-c1ccccc1)S(=O)(=O)c1ccc(cc1)-c1cccc(c1)[N+]([O-])=O
InChI Key: InChIKey=OWBVFVPKTLCULA-UHFFFAOYSA-N
Data: 4 IC50
Activity Spreadsheet -- Enzyme Inhibition Constant Data from BindingDB
Found 4 hits for monomerid = 50105808
Trg + Lig
Ki
nM
ΔG°
kcal/mole
IC50
nM
Kd
nM
EC50/IC50
nM
koff
s-1
kon
M-1s-1
pHTemp
°C
Cytochrome P450 2C19
(Homo sapiens (Human))
BDBM50105808
(3'-Nitro-biphenyl-4-sulfonic acid (3-hydroxy-propy...)
Show SMILES OCCCN(c1ccnn1-c1ccccc1)S(=O)(=O)c1ccc(cc1)-c1cccc(c1)[N+]([O-])=O
Show InChI InChI=1S/C24H22N4O5S/c29-17-5-16-26(24-14-15-25-27(24)21-7-2-1-3-8-21)34(32,33)23-12-10-19(11-13-23)20-6-4-9-22(18-20)28(30)31/h1-4,6-15,18,29H,5,16-17H2
Reactome pathway
n/an/a 2.00E+5n/an/an/an/an/an/a
Université Paris V
Curated by ChEMBL
Assay Description
Inhibitory effect on human recombinant liver cytochrome P450 2C19 expressed in yeast strain
J Med Chem 44: 3622-31 (2001)
BindingDB Entry DOI: 10.7270/Q20Z72KC
Cytochrome P450 2C9
(Homo sapiens (Human))
BDBM50105808
(3'-Nitro-biphenyl-4-sulfonic acid (3-hydroxy-propy...)
Show SMILES OCCCN(c1ccnn1-c1ccccc1)S(=O)(=O)c1ccc(cc1)-c1cccc(c1)[N+]([O-])=O
Show InChI InChI=1S/C24H22N4O5S/c29-17-5-16-26(24-14-15-25-27(24)21-7-2-1-3-8-21)34(32,33)23-12-10-19(11-13-23)20-6-4-9-22(18-20)28(30)31/h1-4,6-15,18,29H,5,16-17H2
Reactome pathway
n/an/a 2.80E+4n/an/an/an/an/an/a
Université Paris V
Curated by ChEMBL
Assay Description
Inhibitory effect on human recombinant liver cytochrome P450 2C9 expressed in yeast strain
J Med Chem 44: 3622-31 (2001)
BindingDB Entry DOI: 10.7270/Q20Z72KC
Cytochrome P450 2C18
(Homo sapiens (Human))
BDBM50105808
(3'-Nitro-biphenyl-4-sulfonic acid (3-hydroxy-propy...)
Show SMILES OCCCN(c1ccnn1-c1ccccc1)S(=O)(=O)c1ccc(cc1)-c1cccc(c1)[N+]([O-])=O
Show InChI InChI=1S/C24H22N4O5S/c29-17-5-16-26(24-14-15-25-27(24)21-7-2-1-3-8-21)34(32,33)23-12-10-19(11-13-23)20-6-4-9-22(18-20)28(30)31/h1-4,6-15,18,29H,5,16-17H2
NCI pathway
Reactome pathway
n/an/a 8.00E+3n/an/an/an/an/an/a
Université Paris V
Curated by ChEMBL
Assay Description
Inhibitory effect on human recombinant liver cytochrome P450 2C18 expressed in yeast strain
J Med Chem 44: 3622-31 (2001)
BindingDB Entry DOI: 10.7270/Q20Z72KC
Cytochrome P450 2C8
(Homo sapiens (Human))
BDBM50105808
(3'-Nitro-biphenyl-4-sulfonic acid (3-hydroxy-propy...)
Show SMILES OCCCN(c1ccnn1-c1ccccc1)S(=O)(=O)c1ccc(cc1)-c1cccc(c1)[N+]([O-])=O
Show InChI InChI=1S/C24H22N4O5S/c29-17-5-16-26(24-14-15-25-27(24)21-7-2-1-3-8-21)34(32,33)23-12-10-19(11-13-23)20-6-4-9-22(18-20)28(30)31/h1-4,6-15,18,29H,5,16-17H2
n/an/a>2.50E+5n/an/an/an/an/an/a
Université Paris V
Curated by ChEMBL
Assay Description
Inhibitory effect on human recombinant liver Cytochrome P450 2C8 expressed in yeast strain
J Med Chem 44: 3622-31 (2001)
BindingDB Entry DOI: 10.7270/Q20Z72KC