BDBM50105893 9-(3-Guanidino-propyl)-15-(3H-imidazol-4-ylmethyl)-6-(1H-indol-3-ylmethyl)-12-naphthalen-2-ylmethyl-5,8,11,14,17,20-hexaoxo-1,4,7,10,13,16hexaaza-cycloicosane-3-carboxylic acid::CHEMBL434985
SMILES: NC(=N)NCCC[C@@H]1NC(=O)[C@H](Cc2ccc3ccccc3c2)NC(=O)[C@H](Cc2cnc[nH]2)NC(=O)CCC(=O)NCC(NC(=O)[C@@H](Cc2c[nH]c3ccccc23)NC1=O)C(N)=O
InChI Key: InChIKey=UTARRQKZBUCQBR-ISPDCEQMSA-N
Data: 3 KI  1 EC50
Activity Spreadsheet -- Enzyme Inhibition Constant Data from BindingDB
Found 4 hits for monomerid = 50105893
Trg + Lig
Ki
nM
ΔG°
kcal/mole
IC50
nM
Kd
nM
EC50/IC50
nM
koff
s-1
kon
M-1s-1
pHTemp
°C
Melanocortin receptor 4
(Homo sapiens (Human))
BDBM50105893
(9-(3-Guanidino-propyl)-15-(3H-imidazol-4-ylmethyl)...)
Show SMILES NC(=N)NCCC[C@@H]1NC(=O)[C@H](Cc2ccc3ccccc3c2)NC(=O)[C@H](Cc2cnc[nH]2)NC(=O)CCC(=O)NCC(NC(=O)[C@@H](Cc2c[nH]c3ccccc23)NC1=O)C(N)=O
Show InChI InChI=1S/C43H51N13O7/c44-38(59)35-22-50-36(57)13-14-37(58)52-34(19-28-21-47-23-51-28)42(63)54-32(17-24-11-12-25-6-1-2-7-26(25)16-24)40(61)53-31(10-5-15-48-43(45)46)39(60)55-33(41(62)56-35)18-27-20-49-30-9-4-3-8-29(27)30/h1-4,6-9,11-12,16,20-21,23,31-35,49H,5,10,13-15,17-19,22H2,(H2,44,59)(H,47,51)(H,50,57)(H,52,58)(H,53,61)(H,54,63)(H,55,60)(H,56,62)(H4,45,46,48)/t31-,32-,33+,34-,35?/m0/s1
0.260n/an/an/an/an/an/an/an/a
Merck Research Laboratories
Curated by ChEMBL
Assay Description
Binding affinity against human melanocortin receptor 4 (hMC4R) (concentration of the peptide at 50% specific binding)
J Med Chem 44: 3665-72 (2001)
BindingDB Entry DOI: 10.7270/Q2RF5T9S
Melanocortin receptor 3
(Homo sapiens (Human))
BDBM50105893
(9-(3-Guanidino-propyl)-15-(3H-imidazol-4-ylmethyl)...)
Show SMILES NC(=N)NCCC[C@@H]1NC(=O)[C@H](Cc2ccc3ccccc3c2)NC(=O)[C@H](Cc2cnc[nH]2)NC(=O)CCC(=O)NCC(NC(=O)[C@@H](Cc2c[nH]c3ccccc23)NC1=O)C(N)=O
Show InChI InChI=1S/C43H51N13O7/c44-38(59)35-22-50-36(57)13-14-37(58)52-34(19-28-21-47-23-51-28)42(63)54-32(17-24-11-12-25-6-1-2-7-26(25)16-24)40(61)53-31(10-5-15-48-43(45)46)39(60)55-33(41(62)56-35)18-27-20-49-30-9-4-3-8-29(27)30/h1-4,6-9,11-12,16,20-21,23,31-35,49H,5,10,13-15,17-19,22H2,(H2,44,59)(H,47,51)(H,50,57)(H,52,58)(H,53,61)(H,54,63)(H,55,60)(H,56,62)(H4,45,46,48)/t31-,32-,33+,34-,35?/m0/s1
29n/an/an/an/an/an/an/an/a
Merck Research Laboratories
Curated by ChEMBL
Assay Description
Binding affinity against human melanocortin receptor 3 (hMC3R) (concentration of the peptide at 50% specific binding)
J Med Chem 44: 3665-72 (2001)
BindingDB Entry DOI: 10.7270/Q2RF5T9S
Melanocortin receptor 5 (MC5R)
(Homo sapiens (Human))
BDBM50105893
(9-(3-Guanidino-propyl)-15-(3H-imidazol-4-ylmethyl)...)
Show SMILES NC(=N)NCCC[C@@H]1NC(=O)[C@H](Cc2ccc3ccccc3c2)NC(=O)[C@H](Cc2cnc[nH]2)NC(=O)CCC(=O)NCC(NC(=O)[C@@H](Cc2c[nH]c3ccccc23)NC1=O)C(N)=O
Show InChI InChI=1S/C43H51N13O7/c44-38(59)35-22-50-36(57)13-14-37(58)52-34(19-28-21-47-23-51-28)42(63)54-32(17-24-11-12-25-6-1-2-7-26(25)16-24)40(61)53-31(10-5-15-48-43(45)46)39(60)55-33(41(62)56-35)18-27-20-49-30-9-4-3-8-29(27)30/h1-4,6-9,11-12,16,20-21,23,31-35,49H,5,10,13-15,17-19,22H2,(H2,44,59)(H,47,51)(H,50,57)(H,52,58)(H,53,61)(H,54,63)(H,55,60)(H,56,62)(H4,45,46,48)/t31-,32-,33+,34-,35?/m0/s1
65n/an/an/an/an/an/an/an/a
Merck Research Laboratories
Curated by ChEMBL
Assay Description
Binding affinity against human melanocortin receptor 5 (hMC5R) (concentration of the peptide at 50% specific binding)
J Med Chem 44: 3665-72 (2001)
BindingDB Entry DOI: 10.7270/Q2RF5T9S
Melanocortin receptor 5 (MC5R)
(Homo sapiens (Human))
BDBM50105893
(9-(3-Guanidino-propyl)-15-(3H-imidazol-4-ylmethyl)...)
Show SMILES NC(=N)NCCC[C@@H]1NC(=O)[C@H](Cc2ccc3ccccc3c2)NC(=O)[C@H](Cc2cnc[nH]2)NC(=O)CCC(=O)NCC(NC(=O)[C@@H](Cc2c[nH]c3ccccc23)NC1=O)C(N)=O
Show InChI InChI=1S/C43H51N13O7/c44-38(59)35-22-50-36(57)13-14-37(58)52-34(19-28-21-47-23-51-28)42(63)54-32(17-24-11-12-25-6-1-2-7-26(25)16-24)40(61)53-31(10-5-15-48-43(45)46)39(60)55-33(41(62)56-35)18-27-20-49-30-9-4-3-8-29(27)30/h1-4,6-9,11-12,16,20-21,23,31-35,49H,5,10,13-15,17-19,22H2,(H2,44,59)(H,47,51)(H,50,57)(H,52,58)(H,53,61)(H,54,63)(H,55,60)(H,56,62)(H4,45,46,48)/t31-,32-,33+,34-,35?/m0/s1
n/an/an/an/a 210n/an/an/an/a
Merck Research Laboratories
Curated by ChEMBL
Assay Description
Increase in intracellular cAMP in CHO cells expressing human melanocortin receptor 5.
J Med Chem 44: 3665-72 (2001)
BindingDB Entry DOI: 10.7270/Q2RF5T9S