null
SMILES: CCOC(=O)c1cc(on1)-c1csc(Nc2cccc(SC)c2)n1
InChI Key: InChIKey=XRKLRLHCOGLMLI-UHFFFAOYSA-N
Activity Spreadsheet -- Enzyme Inhibition Constant Data from BindingDB
Found 1 hit for monomerid = 50105911
Trg + Lig
Ki
nM
ΔG°
kcal/mole
IC50
nM
Kd
nM
EC50/IC50
nM
koff
s-1
kon
M-1s-1
pHTemp
°C
Cystic fibrosis transmembrane conductance regulator
(Homo sapiens (Human))
BDBM50105911
(CHEMBL3597886)
Show SMILES CCOC(=O)c1cc(on1)-c1csc(Nc2cccc(SC)c2)n1
Show InChI InChI=1S/C16H15N3O3S2/c1-3-21-15(20)12-8-14(22-19-12)13-9-24-16(18-13)17-10-5-4-6-11(7-10)23-2/h4-9H,3H2,1-2H3,(H,17,18)
n/an/an/an/a 5.80E+4n/an/an/an/a
Istituto Giannina Gaslini
Curated by ChEMBL
Assay Description
Potentiator activity at CFTR F508del mutant (unknown origin) expressed in human CFBE41o cells assessed as increase in iodine influx measured after 30...
Eur J Med Chem 99: 14-35 (2015)
BindingDB Entry DOI: 10.7270/Q25M67GT