BDBM50105944 3-Hydroxy-4-(2-hydroxy-5-methyl-phenylazo)-naphthalene-1-sulfonic acid::CHEMBL122867
SMILES: Cc1ccc(O)c(c1)N=Nc1c(O)cc(c2ccccc12)S(O)(=O)=O
InChI Key: InChIKey=VBRNLOQCBCPPHL-UHFFFAOYSA-N
Data: 1 EC50
Activity Spreadsheet -- Enzyme Inhibition Constant Data from BindingDB
Found 1 hit for monomerid = 50105944
Trg + Lig
Ki
nM
ΔG°
kcal/mole
IC50
nM
Kd
nM
EC50/IC50
nM
koff
s-1
kon
M-1s-1
pHTemp
°C
Thrombopoietin receptor
(Homo sapiens (Human))
BDBM50105944
(3-Hydroxy-4-(2-hydroxy-5-methyl-phenylazo)-naphtha...)
Show SMILES Cc1ccc(O)c(c1)N=Nc1c(O)cc(c2ccccc12)S(O)(=O)=O |w:8.8|
Show InChI InChI=1S/C17H14N2O5S/c1-10-6-7-14(20)13(8-10)18-19-17-12-5-3-2-4-11(12)16(9-15(17)21)25(22,23)24/h2-9,20-21H,1H3,(H,22,23,24)
Reactome pathway
n/an/an/an/a 3.00E+3n/an/an/an/a
GlaxoSmithKline
Curated by ChEMBL
Assay Description
Effective concentration for thrombopoietin luciferase activity was determined in BAF-3 cells
J Med Chem 44: 3730-45 (2001)
BindingDB Entry DOI: 10.7270/Q2MP52KF