BDBM50106025 (S)-2,2-Dimethyl-4-[4-(3,4,5-trimethoxy-phenoxy)-benzenesulfonyl]-thiomorpholine-3-carboxylic acid hydroxyamide::(S)-N-hydroxy-2,2-dimethyl-4-(4-(3,4,5-trimethoxyphenoxy)phenylsulfonyl)thiomorpholine-3-carboxamide::CHEMBL95305
SMILES: COc1cc(Oc2ccc(cc2)S(=O)(=O)N2CCSC(C)(C)[C@@H]2C(=O)NO)cc(OC)c1OC
InChI Key: InChIKey=DCDJWNFOPNVBIM-FQEVSTJZSA-N
Data: 8 IC50
Activity Spreadsheet -- Enzyme Inhibition Constant Data from BindingDB
Found 8 hits for monomerid = 50106025
Trg + Lig
Ki
nM
ΔG°
kcal/mole
IC50
nM
Kd
nM
EC50/IC50
nM
koff
s-1
kon
M-1s-1
pHTemp
°C
Interstitial collagenase
(Homo sapiens (Human))
BDBM50106025
((S)-2,2-Dimethyl-4-[4-(3,4,5-trimethoxy-phenoxy)-b...)
Show SMILES COc1cc(Oc2ccc(cc2)S(=O)(=O)N2CCSC(C)(C)[C@@H]2C(=O)NO)cc(OC)c1OC |r|
Show InChI InChI=1S/C22H28N2O8S2/c1-22(2)20(21(25)23-26)24(10-11-33-22)34(27,28)16-8-6-14(7-9-16)32-15-12-17(29-3)19(31-5)18(13-15)30-4/h6-9,12-13,20,26H,10-11H2,1-5H3,(H,23,25)/t20-/m0/s1
Reactome pathway
n/an/a 26n/an/an/an/an/an/a
Abbott Laboratories
Curated by ChEMBL
Assay Description
Inhibitory concentration against Matrix metalloproteinase-1
Bioorg Med Chem Lett 11: 2907-10 (2001)
BindingDB Entry DOI: 10.7270/Q2C828MX
72 kDa type IV collagenase
(Homo sapiens (Human))
BDBM50106025
((S)-2,2-Dimethyl-4-[4-(3,4,5-trimethoxy-phenoxy)-b...)
Show SMILES COc1cc(Oc2ccc(cc2)S(=O)(=O)N2CCSC(C)(C)[C@@H]2C(=O)NO)cc(OC)c1OC |r|
Show InChI InChI=1S/C22H28N2O8S2/c1-22(2)20(21(25)23-26)24(10-11-33-22)34(27,28)16-8-6-14(7-9-16)32-15-12-17(29-3)19(31-5)18(13-15)30-4/h6-9,12-13,20,26H,10-11H2,1-5H3,(H,23,25)/t20-/m0/s1
Reactome pathway
n/an/a 21n/an/an/an/an/an/a
Abbott Laboratories
Curated by ChEMBL
Assay Description
Inhibition against Matrix metalloproteinase-2
Bioorg Med Chem Lett 11: 2907-10 (2001)
BindingDB Entry DOI: 10.7270/Q2C828MX
Disintegrin and metalloproteinase domain-containing protein 17
(Homo sapiens (Human))
BDBM50106025
((S)-2,2-Dimethyl-4-[4-(3,4,5-trimethoxy-phenoxy)-b...)
Show SMILES COc1cc(Oc2ccc(cc2)S(=O)(=O)N2CCSC(C)(C)[C@@H]2C(=O)NO)cc(OC)c1OC |r|
Show InChI InChI=1S/C22H28N2O8S2/c1-22(2)20(21(25)23-26)24(10-11-33-22)34(27,28)16-8-6-14(7-9-16)32-15-12-17(29-3)19(31-5)18(13-15)30-4/h6-9,12-13,20,26H,10-11H2,1-5H3,(H,23,25)/t20-/m0/s1
Reactome pathway
n/an/a 1.5n/an/an/an/an/an/a
Abbott Laboratories
Curated by ChEMBL
Assay Description
Inhibitory concentration against Tumor necrosis factor alpha converting enzyme
Bioorg Med Chem Lett 11: 2907-10 (2001)
BindingDB Entry DOI: 10.7270/Q2C828MX
Disintegrin and metalloproteinase domain-containing protein 17
(Homo sapiens (Human))
BDBM50106025
((S)-2,2-Dimethyl-4-[4-(3,4,5-trimethoxy-phenoxy)-b...)
Show SMILES COc1cc(Oc2ccc(cc2)S(=O)(=O)N2CCSC(C)(C)[C@@H]2C(=O)NO)cc(OC)c1OC |r|
Show InChI InChI=1S/C22H28N2O8S2/c1-22(2)20(21(25)23-26)24(10-11-33-22)34(27,28)16-8-6-14(7-9-16)32-15-12-17(29-3)19(31-5)18(13-15)30-4/h6-9,12-13,20,26H,10-11H2,1-5H3,(H,23,25)/t20-/m0/s1
Reactome pathway
n/an/a 1.60n/an/an/an/an/an/a
Nestl� Skin Health R&D
Curated by ChEMBL
Assay Description
Inhibition of TACE (unknown origin)
Bioorg Med Chem Lett 27: 1848-1853 (2017)
Article DOI: 10.1016/j.bmcl.2017.02.035
BindingDB Entry DOI: 10.7270/Q28S4S59
Disintegrin and metalloproteinase domain-containing protein 17
(Homo sapiens (Human))
BDBM50106025
((S)-2,2-Dimethyl-4-[4-(3,4,5-trimethoxy-phenoxy)-b...)
Show SMILES COc1cc(Oc2ccc(cc2)S(=O)(=O)N2CCSC(C)(C)[C@@H]2C(=O)NO)cc(OC)c1OC |r|
Show InChI InChI=1S/C22H28N2O8S2/c1-22(2)20(21(25)23-26)24(10-11-33-22)34(27,28)16-8-6-14(7-9-16)32-15-12-17(29-3)19(31-5)18(13-15)30-4/h6-9,12-13,20,26H,10-11H2,1-5H3,(H,23,25)/t20-/m0/s1
Reactome pathway
n/an/a 1.5n/an/an/an/an/an/a
Nestl� Skin Health R&D
Curated by ChEMBL
Assay Description
Inhibition of TACE (unknown origin)
Bioorg Med Chem Lett 27: 1848-1853 (2017)
Article DOI: 10.1016/j.bmcl.2017.02.035
BindingDB Entry DOI: 10.7270/Q28S4S59
Disintegrin and metalloproteinase domain-containing protein 17
(Homo sapiens (Human))
BDBM50106025
((S)-2,2-Dimethyl-4-[4-(3,4,5-trimethoxy-phenoxy)-b...)
Show SMILES COc1cc(Oc2ccc(cc2)S(=O)(=O)N2CCSC(C)(C)[C@@H]2C(=O)NO)cc(OC)c1OC |r|
Show InChI InChI=1S/C22H28N2O8S2/c1-22(2)20(21(25)23-26)24(10-11-33-22)34(27,28)16-8-6-14(7-9-16)32-15-12-17(29-3)19(31-5)18(13-15)30-4/h6-9,12-13,20,26H,10-11H2,1-5H3,(H,23,25)/t20-/m0/s1
Reactome pathway
n/an/a 550n/an/an/an/an/an/a
Nestl� Skin Health R&D
Curated by ChEMBL
Assay Description
Inhibition of TACE (unknown origin) by cell based assay
Bioorg Med Chem Lett 27: 1848-1853 (2017)
Article DOI: 10.1016/j.bmcl.2017.02.035
BindingDB Entry DOI: 10.7270/Q28S4S59
Disintegrin and metalloproteinase domain-containing protein 17
(Homo sapiens (Human))
BDBM50106025
((S)-2,2-Dimethyl-4-[4-(3,4,5-trimethoxy-phenoxy)-b...)
Show SMILES COc1cc(Oc2ccc(cc2)S(=O)(=O)N2CCSC(C)(C)[C@@H]2C(=O)NO)cc(OC)c1OC |r|
Show InChI InChI=1S/C22H28N2O8S2/c1-22(2)20(21(25)23-26)24(10-11-33-22)34(27,28)16-8-6-14(7-9-16)32-15-12-17(29-3)19(31-5)18(13-15)30-4/h6-9,12-13,20,26H,10-11H2,1-5H3,(H,23,25)/t20-/m0/s1
Reactome pathway
n/an/a 501n/an/an/an/an/an/a
Nestl� Skin Health R&D
Curated by ChEMBL
Assay Description
Inhibition of TACE (unknown origin) by cell based assay
Bioorg Med Chem Lett 27: 1848-1853 (2017)
Article DOI: 10.1016/j.bmcl.2017.02.035
BindingDB Entry DOI: 10.7270/Q28S4S59
Disintegrin and metalloproteinase domain-containing protein 17
(Homo sapiens (Human))
BDBM50106025
((S)-2,2-Dimethyl-4-[4-(3,4,5-trimethoxy-phenoxy)-b...)
Show SMILES COc1cc(Oc2ccc(cc2)S(=O)(=O)N2CCSC(C)(C)[C@@H]2C(=O)NO)cc(OC)c1OC |r|
Show InChI InChI=1S/C22H28N2O8S2/c1-22(2)20(21(25)23-26)24(10-11-33-22)34(27,28)16-8-6-14(7-9-16)32-15-12-17(29-3)19(31-5)18(13-15)30-4/h6-9,12-13,20,26H,10-11H2,1-5H3,(H,23,25)/t20-/m0/s1
Reactome pathway
n/an/a 550n/an/an/an/an/an/a
Abbott Laboratories
Curated by ChEMBL
Assay Description
Concentration required to inhibit the release of tumor necrosis factor -alpha (TNF-alpha) in THP-1 cellular assay.
Bioorg Med Chem Lett 11: 2907-10 (2001)
BindingDB Entry DOI: 10.7270/Q2C828MX