BDBM50106026 (S)-2,2-Dimethyl-4-[4-(pyridin-3-yloxy)-benzenesulfonyl]-thiomorpholine-3-carboxylic acid hydroxyamide::CHEMBL318484
SMILES: CC1(C)SCCN([C@H]1C(=O)NO)S(=O)(=O)c1ccc(Oc2cccnc2)cc1
InChI Key: InChIKey=YTRMRJDVKQXSIU-INIZCTEOSA-N
Data: 7 IC50
Activity Spreadsheet -- Enzyme Inhibition Constant Data from BindingDB
Found 7 hits for monomerid = 50106026
Trg + Lig
Ki
nM
ΔG°
kcal/mole
IC50
nM
Kd
nM
EC50/IC50
nM
koff
s-1
kon
M-1s-1
pHTemp
°C
Disintegrin and metalloproteinase domain-containing protein 17
(Homo sapiens (Human))
BDBM50106026
((S)-2,2-Dimethyl-4-[4-(pyridin-3-yloxy)-benzenesul...)
Show SMILES CC1(C)SCCN([C@H]1C(=O)NO)S(=O)(=O)c1ccc(Oc2cccnc2)cc1
Show InChI InChI=1S/C18H21N3O5S2/c1-18(2)16(17(22)20-23)21(10-11-27-18)28(24,25)15-7-5-13(6-8-15)26-14-4-3-9-19-12-14/h3-9,12,16,23H,10-11H2,1-2H3,(H,20,22)/t16-/m0/s1
Reactome pathway
n/an/a 8.60E+3n/an/an/an/an/an/a
Abbott Laboratories
Curated by ChEMBL
Assay Description
Concentration required to inhibit the release of tumor necrosis factor -alpha (TNF-alpha) in THP-1 cellular assay.
Bioorg Med Chem Lett 11: 2907-10 (2001)
BindingDB Entry DOI: 10.7270/Q2C828MX
Interstitial collagenase
(Homo sapiens (Human))
BDBM50106026
((S)-2,2-Dimethyl-4-[4-(pyridin-3-yloxy)-benzenesul...)
Show SMILES CC1(C)SCCN([C@H]1C(=O)NO)S(=O)(=O)c1ccc(Oc2cccnc2)cc1
Show InChI InChI=1S/C18H21N3O5S2/c1-18(2)16(17(22)20-23)21(10-11-27-18)28(24,25)15-7-5-13(6-8-15)26-14-4-3-9-19-12-14/h3-9,12,16,23H,10-11H2,1-2H3,(H,20,22)/t16-/m0/s1
Reactome pathway
n/an/a 5.70n/an/an/an/an/an/a
Abbott Laboratories
Curated by ChEMBL
Assay Description
Inhibitory concentration against Matrix metalloproteinase-1
Bioorg Med Chem Lett 11: 2907-10 (2001)
BindingDB Entry DOI: 10.7270/Q2C828MX
72 kDa type IV collagenase
(Homo sapiens (Human))
BDBM50106026
((S)-2,2-Dimethyl-4-[4-(pyridin-3-yloxy)-benzenesul...)
Show SMILES CC1(C)SCCN([C@H]1C(=O)NO)S(=O)(=O)c1ccc(Oc2cccnc2)cc1
Show InChI InChI=1S/C18H21N3O5S2/c1-18(2)16(17(22)20-23)21(10-11-27-18)28(24,25)15-7-5-13(6-8-15)26-14-4-3-9-19-12-14/h3-9,12,16,23H,10-11H2,1-2H3,(H,20,22)/t16-/m0/s1
Reactome pathway
n/an/a 0.0480n/an/an/an/an/an/a
Abbott Laboratories
Curated by ChEMBL
Assay Description
Inhibitory concentration against Matrix metalloproteinase-2
Bioorg Med Chem Lett 11: 2907-10 (2001)
BindingDB Entry DOI: 10.7270/Q2C828MX
Disintegrin and metalloproteinase domain-containing protein 17
(Homo sapiens (Human))
BDBM50106026
((S)-2,2-Dimethyl-4-[4-(pyridin-3-yloxy)-benzenesul...)
Show SMILES CC1(C)SCCN([C@H]1C(=O)NO)S(=O)(=O)c1ccc(Oc2cccnc2)cc1
Show InChI InChI=1S/C18H21N3O5S2/c1-18(2)16(17(22)20-23)21(10-11-27-18)28(24,25)15-7-5-13(6-8-15)26-14-4-3-9-19-12-14/h3-9,12,16,23H,10-11H2,1-2H3,(H,20,22)/t16-/m0/s1
Reactome pathway
n/an/a 7.94E+3n/an/an/an/an/an/a
Nestl� Skin Health R&D
Curated by ChEMBL
Assay Description
Inhibition of TACE (unknown origin)
Bioorg Med Chem Lett 27: 1848-1853 (2017)
Article DOI: 10.1016/j.bmcl.2017.02.035
BindingDB Entry DOI: 10.7270/Q28S4S59
Disintegrin and metalloproteinase domain-containing protein 17
(Homo sapiens (Human))
BDBM50106026
((S)-2,2-Dimethyl-4-[4-(pyridin-3-yloxy)-benzenesul...)
Show SMILES CC1(C)SCCN([C@H]1C(=O)NO)S(=O)(=O)c1ccc(Oc2cccnc2)cc1
Show InChI InChI=1S/C18H21N3O5S2/c1-18(2)16(17(22)20-23)21(10-11-27-18)28(24,25)15-7-5-13(6-8-15)26-14-4-3-9-19-12-14/h3-9,12,16,23H,10-11H2,1-2H3,(H,20,22)/t16-/m0/s1
Reactome pathway
n/an/a 8.60E+3n/an/an/an/an/an/a
Nestl� Skin Health R&D
Curated by ChEMBL
Assay Description
Inhibition of TACE (unknown origin) by cell based assay
Bioorg Med Chem Lett 27: 1848-1853 (2017)
Article DOI: 10.1016/j.bmcl.2017.02.035
BindingDB Entry DOI: 10.7270/Q28S4S59
Disintegrin and metalloproteinase domain-containing protein 17
(Homo sapiens (Human))
BDBM50106026
((S)-2,2-Dimethyl-4-[4-(pyridin-3-yloxy)-benzenesul...)
Show SMILES CC1(C)SCCN([C@H]1C(=O)NO)S(=O)(=O)c1ccc(Oc2cccnc2)cc1
Show InChI InChI=1S/C18H21N3O5S2/c1-18(2)16(17(22)20-23)21(10-11-27-18)28(24,25)15-7-5-13(6-8-15)26-14-4-3-9-19-12-14/h3-9,12,16,23H,10-11H2,1-2H3,(H,20,22)/t16-/m0/s1
Reactome pathway
n/an/a 7.90n/an/an/an/an/an/a
Nestl� Skin Health R&D
Curated by ChEMBL
Assay Description
Inhibition of TACE (unknown origin)
Bioorg Med Chem Lett 27: 1848-1853 (2017)
Article DOI: 10.1016/j.bmcl.2017.02.035
BindingDB Entry DOI: 10.7270/Q28S4S59
Disintegrin and metalloproteinase domain-containing protein 17
(Homo sapiens (Human))
BDBM50106026
((S)-2,2-Dimethyl-4-[4-(pyridin-3-yloxy)-benzenesul...)
Show SMILES CC1(C)SCCN([C@H]1C(=O)NO)S(=O)(=O)c1ccc(Oc2cccnc2)cc1
Show InChI InChI=1S/C18H21N3O5S2/c1-18(2)16(17(22)20-23)21(10-11-27-18)28(24,25)15-7-5-13(6-8-15)26-14-4-3-9-19-12-14/h3-9,12,16,23H,10-11H2,1-2H3,(H,20,22)/t16-/m0/s1
Reactome pathway
n/an/a 7.90n/an/an/an/an/an/a
Abbott Laboratories
Curated by ChEMBL
Assay Description
Concentration required to inhibit the release of tumor necrosis factor -alpha (TNF-alpha) in THP-1 cellular assay.
Bioorg Med Chem Lett 11: 2907-10 (2001)
BindingDB Entry DOI: 10.7270/Q2C828MX