BDBM50106028 (7S,8R,11S)-8-(3-naphthalen-1-yl-propyl)-9-oxo-2-oxa-10-aza-bicyclo[11.2.2]heptadeca-1(16),13(17),14-triene-7,11-dicarboxylic acid 7-hydroxyamide 11-methylamide::CHEMBL99103
SMILES: CNC(=O)[C@@H]1Cc2ccc(OCCCC[C@@H]([C@@H](CCCc3cccc4ccccc34)C(=O)N1)C(=O)NO)cc2
InChI Key: InChIKey=KAJAADJOOYZIPJ-PKTNWEFCSA-N
Data: 9 IC50
Activity Spreadsheet -- Enzyme Inhibition Constant Data from BindingDB
Found 9 hits for monomerid = 50106028
Trg + Lig
Ki
nM
ΔG°
kcal/mole
IC50
nM
Kd
nM
EC50/IC50
nM
koff
s-1
kon
M-1s-1
pHTemp
°C
Disintegrin and metalloproteinase domain-containing protein 17
(Homo sapiens (Human))
BDBM50106028
((7S,8R,11S)-8-(3-naphthalen-1-yl-propyl)-9-oxo-2-o...)
Show SMILES CNC(=O)[C@@H]1Cc2ccc(OCCCC[C@@H]([C@@H](CCCc3cccc4ccccc34)C(=O)N1)C(=O)NO)cc2
Show InChI InChI=1S/C31H37N3O5/c1-32-31(37)28-20-21-15-17-24(18-16-21)39-19-5-4-13-27(30(36)34-38)26(29(35)33-28)14-7-11-23-10-6-9-22-8-2-3-12-25(22)23/h2-3,6,8-10,12,15-18,26-28,38H,4-5,7,11,13-14,19-20H2,1H3,(H,32,37)(H,33,35)(H,34,36)/t26-,27+,28+/m1/s1
Reactome pathway
n/an/a 6n/an/an/an/an/an/a
Abbott Laboratories
Curated by ChEMBL
Assay Description
Inhibitory concentration against Tumor necrosis factor alpha converting enzyme
Bioorg Med Chem Lett 11: 2907-10 (2001)
BindingDB Entry DOI: 10.7270/Q2C828MX
Interstitial collagenase
(Homo sapiens (Human))
BDBM50106028
((7S,8R,11S)-8-(3-naphthalen-1-yl-propyl)-9-oxo-2-o...)
Show SMILES CNC(=O)[C@@H]1Cc2ccc(OCCCC[C@@H]([C@@H](CCCc3cccc4ccccc34)C(=O)N1)C(=O)NO)cc2
Show InChI InChI=1S/C31H37N3O5/c1-32-31(37)28-20-21-15-17-24(18-16-21)39-19-5-4-13-27(30(36)34-38)26(29(35)33-28)14-7-11-23-10-6-9-22-8-2-3-12-25(22)23/h2-3,6,8-10,12,15-18,26-28,38H,4-5,7,11,13-14,19-20H2,1H3,(H,32,37)(H,33,35)(H,34,36)/t26-,27+,28+/m1/s1
Reactome pathway
n/an/a 28n/an/an/an/an/an/a
Abbott Laboratories
Curated by ChEMBL
Assay Description
Inhibitory concentration against Matrix metalloproteinase-1
Bioorg Med Chem Lett 11: 2907-10 (2001)
BindingDB Entry DOI: 10.7270/Q2C828MX
72 kDa type IV collagenase
(Homo sapiens (Human))
BDBM50106028
((7S,8R,11S)-8-(3-naphthalen-1-yl-propyl)-9-oxo-2-o...)
Show SMILES CNC(=O)[C@@H]1Cc2ccc(OCCCC[C@@H]([C@@H](CCCc3cccc4ccccc34)C(=O)N1)C(=O)NO)cc2
Show InChI InChI=1S/C31H37N3O5/c1-32-31(37)28-20-21-15-17-24(18-16-21)39-19-5-4-13-27(30(36)34-38)26(29(35)33-28)14-7-11-23-10-6-9-22-8-2-3-12-25(22)23/h2-3,6,8-10,12,15-18,26-28,38H,4-5,7,11,13-14,19-20H2,1H3,(H,32,37)(H,33,35)(H,34,36)/t26-,27+,28+/m1/s1
Reactome pathway
n/an/a 0.230n/an/an/an/an/an/a
Abbott Laboratories
Curated by ChEMBL
Assay Description
Inhibitory concentration against Matrix metalloproteinase-2
Bioorg Med Chem Lett 11: 2907-10 (2001)
BindingDB Entry DOI: 10.7270/Q2C828MX
Disintegrin and metalloproteinase domain-containing protein 17
(Homo sapiens (Human))
BDBM50106028
((7S,8R,11S)-8-(3-naphthalen-1-yl-propyl)-9-oxo-2-o...)
Show SMILES CNC(=O)[C@@H]1Cc2ccc(OCCCC[C@@H]([C@@H](CCCc3cccc4ccccc34)C(=O)N1)C(=O)NO)cc2
Show InChI InChI=1S/C31H37N3O5/c1-32-31(37)28-20-21-15-17-24(18-16-21)39-19-5-4-13-27(30(36)34-38)26(29(35)33-28)14-7-11-23-10-6-9-22-8-2-3-12-25(22)23/h2-3,6,8-10,12,15-18,26-28,38H,4-5,7,11,13-14,19-20H2,1H3,(H,32,37)(H,33,35)(H,34,36)/t26-,27+,28+/m1/s1
Reactome pathway
n/an/a 440n/an/an/an/an/an/a
Abbott Laboratories
Curated by ChEMBL
Assay Description
Inhibitory concentration against Tumor necrosis factor alpha converting enzyme
Bioorg Med Chem Lett 11: 2907-10 (2001)
BindingDB Entry DOI: 10.7270/Q2C828MX
Disintegrin and metalloproteinase domain-containing protein 17
(Homo sapiens (Human))
BDBM50106028
((7S,8R,11S)-8-(3-naphthalen-1-yl-propyl)-9-oxo-2-o...)
Show SMILES CNC(=O)[C@@H]1Cc2ccc(OCCCC[C@@H]([C@@H](CCCc3cccc4ccccc34)C(=O)N1)C(=O)NO)cc2
Show InChI InChI=1S/C31H37N3O5/c1-32-31(37)28-20-21-15-17-24(18-16-21)39-19-5-4-13-27(30(36)34-38)26(29(35)33-28)14-7-11-23-10-6-9-22-8-2-3-12-25(22)23/h2-3,6,8-10,12,15-18,26-28,38H,4-5,7,11,13-14,19-20H2,1H3,(H,32,37)(H,33,35)(H,34,36)/t26-,27+,28+/m1/s1
Reactome pathway
n/an/a 398n/an/an/an/an/an/a
Nestl� Skin Health R&D
Curated by ChEMBL
Assay Description
In vitro displacement of [3H]spiperone from the recombinant human dopamine receptor D2L stably expressed in CHO cells
Bioorg Med Chem Lett 27: 1848-1853 (2017)
Article DOI: 10.1016/j.bmcl.2017.02.035
BindingDB Entry DOI: 10.7270/Q28S4S59
Disintegrin and metalloproteinase domain-containing protein 17
(Homo sapiens (Human))
BDBM50106028
((7S,8R,11S)-8-(3-naphthalen-1-yl-propyl)-9-oxo-2-o...)
Show SMILES CNC(=O)[C@@H]1Cc2ccc(OCCCC[C@@H]([C@@H](CCCc3cccc4ccccc34)C(=O)N1)C(=O)NO)cc2
Show InChI InChI=1S/C31H37N3O5/c1-32-31(37)28-20-21-15-17-24(18-16-21)39-19-5-4-13-27(30(36)34-38)26(29(35)33-28)14-7-11-23-10-6-9-22-8-2-3-12-25(22)23/h2-3,6,8-10,12,15-18,26-28,38H,4-5,7,11,13-14,19-20H2,1H3,(H,32,37)(H,33,35)(H,34,36)/t26-,27+,28+/m1/s1
Reactome pathway
n/an/a 440n/an/an/an/an/an/a
Nestl� Skin Health R&D
Curated by ChEMBL
Assay Description
Displacement of [3H]17-beta-estradiol from human Estrogen receptor alpha
Bioorg Med Chem Lett 27: 1848-1853 (2017)
Article DOI: 10.1016/j.bmcl.2017.02.035
BindingDB Entry DOI: 10.7270/Q28S4S59
Disintegrin and metalloproteinase domain-containing protein 17
(Homo sapiens (Human))
BDBM50106028
((7S,8R,11S)-8-(3-naphthalen-1-yl-propyl)-9-oxo-2-o...)
Show SMILES CNC(=O)[C@@H]1Cc2ccc(OCCCC[C@@H]([C@@H](CCCc3cccc4ccccc34)C(=O)N1)C(=O)NO)cc2
Show InChI InChI=1S/C31H37N3O5/c1-32-31(37)28-20-21-15-17-24(18-16-21)39-19-5-4-13-27(30(36)34-38)26(29(35)33-28)14-7-11-23-10-6-9-22-8-2-3-12-25(22)23/h2-3,6,8-10,12,15-18,26-28,38H,4-5,7,11,13-14,19-20H2,1H3,(H,32,37)(H,33,35)(H,34,36)/t26-,27+,28+/m1/s1
Reactome pathway
n/an/a 6.30n/an/an/an/an/an/a
Nestl� Skin Health R&D
Curated by ChEMBL
Assay Description
Inhibition of TACE (unknown origin)
Bioorg Med Chem Lett 27: 1848-1853 (2017)
Article DOI: 10.1016/j.bmcl.2017.02.035
BindingDB Entry DOI: 10.7270/Q28S4S59
Disintegrin and metalloproteinase domain-containing protein 17
(Homo sapiens (Human))
BDBM50106028
((7S,8R,11S)-8-(3-naphthalen-1-yl-propyl)-9-oxo-2-o...)
Show SMILES CNC(=O)[C@@H]1Cc2ccc(OCCCC[C@@H]([C@@H](CCCc3cccc4ccccc34)C(=O)N1)C(=O)NO)cc2
Show InChI InChI=1S/C31H37N3O5/c1-32-31(37)28-20-21-15-17-24(18-16-21)39-19-5-4-13-27(30(36)34-38)26(29(35)33-28)14-7-11-23-10-6-9-22-8-2-3-12-25(22)23/h2-3,6,8-10,12,15-18,26-28,38H,4-5,7,11,13-14,19-20H2,1H3,(H,32,37)(H,33,35)(H,34,36)/t26-,27+,28+/m1/s1
Reactome pathway
n/an/a 6n/an/an/an/an/an/a
Nestl� Skin Health R&D
Curated by ChEMBL
Assay Description
Inhibition of TACE (unknown origin)
Bioorg Med Chem Lett 27: 1848-1853 (2017)
Article DOI: 10.1016/j.bmcl.2017.02.035
BindingDB Entry DOI: 10.7270/Q28S4S59
Interstitial collagenase
(Homo sapiens (Human))
BDBM50106028
((7S,8R,11S)-8-(3-naphthalen-1-yl-propyl)-9-oxo-2-o...)
Show SMILES CNC(=O)[C@@H]1Cc2ccc(OCCCC[C@@H]([C@@H](CCCc3cccc4ccccc34)C(=O)N1)C(=O)NO)cc2
Show InChI InChI=1S/C31H37N3O5/c1-32-31(37)28-20-21-15-17-24(18-16-21)39-19-5-4-13-27(30(36)34-38)26(29(35)33-28)14-7-11-23-10-6-9-22-8-2-3-12-25(22)23/h2-3,6,8-10,12,15-18,26-28,38H,4-5,7,11,13-14,19-20H2,1H3,(H,32,37)(H,33,35)(H,34,36)/t26-,27+,28+/m1/s1
Reactome pathway
n/an/a 28n/an/an/an/an/an/a
Pomona College
Curated by ChEMBL
Assay Description
Inhibition of MMP1
Bioorg Med Chem 15: 2223-68 (2007)
Article DOI: 10.1016/j.bmc.2007.01.011
BindingDB Entry DOI: 10.7270/Q2571DBD