BDBM50106227 (3R,4S)-Ethanesulfonic acid (6-cyano-3-hydroxy-2,2-dimethyl-chroman-4-yl)-methyl-amide::CHEMBL434045
SMILES: CCS(=O)(=O)N(C)[C@@H]1[C@@H](O)C(C)(C)Oc2ccc(cc12)C#N
InChI Key: InChIKey=HVSJHHXUORMCGK-UONOGXRCSA-N
Data: 2 IC50
Activity Spreadsheet -- Enzyme Inhibition Constant Data from BindingDB
Found 2 hits for monomerid = 50106227
Trg + Lig
Ki
nM
ΔG°
kcal/mole
IC50
nM
Kd
nM
EC50/IC50
nM
koff
s-1
kon
M-1s-1
pHTemp
°C
Voltage-gated potassium channel subunit Kv7.1
(Cavia porcellus)
BDBM50106227
((3R,4S)-Ethanesulfonic acid (6-cyano-3-hydroxy-2,2...)
Show SMILES CCS(=O)(=O)N(C)[C@@H]1[C@@H](O)C(C)(C)Oc2ccc(cc12)C#N
Show InChI InChI=1S/C15H20N2O4S/c1-5-22(19,20)17(4)13-11-8-10(9-16)6-7-12(11)21-15(2,3)14(13)18/h6-8,13-14,18H,5H2,1-4H3/t13-,14+/m0/s1
n/an/a 5.00E+3n/an/an/an/an/an/a
Prestwick Chemical Inc.
Curated by ChEMBL
Assay Description
Inhibition of guinea pig Iks potassium channel expressed in Xenopus oocytes
J Med Chem 47: 1303-14 (2004)
Article DOI: 10.1021/jm030480f
BindingDB Entry DOI: 10.7270/Q2FN16X5
Voltage-gated potassium channel beta subunit Mink/subunit Kv7.1
(Homo sapiens (Human))
BDBM50106227
((3R,4S)-Ethanesulfonic acid (6-cyano-3-hydroxy-2,2...)
Show SMILES CCS(=O)(=O)N(C)[C@@H]1[C@@H](O)C(C)(C)Oc2ccc(cc12)C#N
Show InChI InChI=1S/C15H20N2O4S/c1-5-22(19,20)17(4)13-11-8-10(9-16)6-7-12(11)21-15(2,3)14(13)18/h6-8,13-14,18H,5H2,1-4H3/t13-,14+/m0/s1
n/an/a 5.00E+3n/an/an/an/an/an/a
Aventis Pharma Deutschland GmbH
Curated by ChEMBL
Assay Description
Inhibition of human IKs-channel expressed in Xenopus oocytes,(Experiment 1)
J Med Chem 44: 3831-7 (2001)
BindingDB Entry DOI: 10.7270/Q26H4GPX