null
SMILES: FC(F)(F)c1cc(COCC2(CCNCC2)c2ccccc2)cc(c1)-c1ccc(C#N)c(Cl)c1
InChI Key: InChIKey=VTVCZIHIGNJHON-UHFFFAOYSA-N
Activity Spreadsheet -- Enzyme Inhibition Constant Data from BindingDB
Found 1 hit for monomerid = 50106361
Trg + Lig
Ki
nM
ΔG°
kcal/mole
IC50
nM
Kd
nM
EC50/IC50
nM
koff
s-1
kon
M-1s-1
pHTemp
°C
Substance-P receptor
(Rattus norvegicus (rat))
BDBM50106361
(CHEMBL3596488)
Show SMILES FC(F)(F)c1cc(COCC2(CCNCC2)c2ccccc2)cc(c1)-c1ccc(C#N)c(Cl)c1
Show InChI InChI=1S/C27H24ClF3N2O/c28-25-15-20(6-7-21(25)16-32)22-12-19(13-24(14-22)27(29,30)31)17-34-18-26(8-10-33-11-9-26)23-4-2-1-3-5-23/h1-7,12-15,33H,8-11,17-18H2
Reactome pathway
n/an/a 1.10n/an/an/an/an/an/a
Bristol-Myers Squibb Co.
Curated by ChEMBL
Assay Description
Displacement of [125I]-substance P from gerbil NK1 receptor expressed in HEK293 cell membranes incubated for 30 mins by liquid scintillation counting...
Bioorg Med Chem Lett 25: 3039-43 (2015)
BindingDB Entry DOI: 10.7270/Q24M9690