null
SMILES: Cc1cc(ccc1C#N)-c1cc(COCC2(CCNCC2)c2ccccc2)cc(c1)C(F)(F)F
InChI Key: InChIKey=WLQSLLDHJGPWEI-UHFFFAOYSA-N
Activity Spreadsheet -- Enzyme Inhibition Constant Data from BindingDB
Found 1 hit for monomerid = 50106362
Trg + Lig
Ki
nM
ΔG°
kcal/mole
IC50
nM
Kd
nM
EC50/IC50
nM
koff
s-1
kon
M-1s-1
pHTemp
°C
Substance-P receptor
(Rattus norvegicus (rat))
BDBM50106362
(CHEMBL3596489)
Show SMILES Cc1cc(ccc1C#N)-c1cc(COCC2(CCNCC2)c2ccccc2)cc(c1)C(F)(F)F
Show InChI InChI=1S/C28H27F3N2O/c1-20-13-22(7-8-23(20)17-32)24-14-21(15-26(16-24)28(29,30)31)18-34-19-27(9-11-33-12-10-27)25-5-3-2-4-6-25/h2-8,13-16,33H,9-12,18-19H2,1H3
Reactome pathway
n/an/a 1.20n/an/an/an/an/an/a
Bristol-Myers Squibb Co.
Curated by ChEMBL
Assay Description
Displacement of [125I]-substance P from gerbil NK1 receptor expressed in HEK293 cell membranes incubated for 30 mins by liquid scintillation counting...
Bioorg Med Chem Lett 25: 3039-43 (2015)
BindingDB Entry DOI: 10.7270/Q24M9690