BDBM50106364 CHEMBL3596491
SMILES: FC(F)(F)c1cc(COCC2(CCNCC2)c2ccccc2)cc(c1)-c1ccc(nc1)C#N
InChI Key: InChIKey=TUNPJDGJDUTKTB-UHFFFAOYSA-N
Data: 1 IC50
Activity Spreadsheet -- Enzyme Inhibition Constant Data from BindingDB
Found 1 hit for monomerid = 50106364
Trg + Lig
Ki
nM
ΔG°
kcal/mole
IC50
nM
Kd
nM
EC50/IC50
nM
koff
s-1
kon
M-1s-1
pHTemp
°C
Neurokinin 1 receptor
(Rattus norvegicus (rat))
BDBM50106364
(CHEMBL3596491)
Show SMILES FC(F)(F)c1cc(COCC2(CCNCC2)c2ccccc2)cc(c1)-c1ccc(nc1)C#N
Show InChI InChI=1S/C26H24F3N3O/c27-26(28,29)23-13-19(12-21(14-23)20-6-7-24(15-30)32-16-20)17-33-18-25(8-10-31-11-9-25)22-4-2-1-3-5-22/h1-7,12-14,16,31H,8-11,17-18H2
Reactome pathway
n/an/a 1.90n/an/an/an/an/an/a
Bristol-Myers Squibb Co.
Curated by ChEMBL
Assay Description
Displacement of [125I]-substance P from gerbil NK1 receptor expressed in HEK293 cell membranes incubated for 30 mins by liquid scintillation counting...
Bioorg Med Chem Lett 25: 3039-43 (2015)
BindingDB Entry DOI: 10.7270/Q24M9690