BDBM50106384 CHEMBL3596472
SMILES: FC(F)(F)c1cc(COCC2(CCNCC2)c2ccccc2)cc(c1)-c1ccc2OCOc2c1
InChI Key: InChIKey=WJNZUDACYWRORF-UHFFFAOYSA-N
Data: 1 IC50
Activity Spreadsheet -- Enzyme Inhibition Constant Data from BindingDB
Found 1 hit for monomerid = 50106384
Trg + Lig
Ki
nM
ΔG°
kcal/mole
IC50
nM
Kd
nM
EC50/IC50
nM
koff
s-1
kon
M-1s-1
pHTemp
°C
Neurokinin 1 receptor
(Rattus norvegicus (rat))
BDBM50106384
(CHEMBL3596472)
Show SMILES FC(F)(F)c1cc(COCC2(CCNCC2)c2ccccc2)cc(c1)-c1ccc2OCOc2c1
Show InChI InChI=1S/C27H26F3NO3/c28-27(29,30)23-13-19(12-21(14-23)20-6-7-24-25(15-20)34-18-33-24)16-32-17-26(8-10-31-11-9-26)22-4-2-1-3-5-22/h1-7,12-15,31H,8-11,16-18H2
Reactome pathway
n/an/a 7.10n/an/an/an/an/an/a
Bristol-Myers Squibb Co.
Curated by ChEMBL
Assay Description
Displacement of [125I]-substance P from gerbil NK1 receptor expressed in HEK293 cell membranes incubated for 30 mins by liquid scintillation counting...
Bioorg Med Chem Lett 25: 3039-43 (2015)
BindingDB Entry DOI: 10.7270/Q24M9690