BDBM50106386 CHEMBL3596474
SMILES: FC(F)(F)c1cc(COCC2(CCNCC2)c2ccccc2)cc(c1)-c1ccc(Cl)cc1
InChI Key: InChIKey=BGJRNIULMOQHMR-UHFFFAOYSA-N
Data: 1 IC50
Activity Spreadsheet -- Enzyme Inhibition Constant Data from BindingDB
Found 1 hit for monomerid = 50106386
Trg + Lig
Ki
nM
ΔG°
kcal/mole
IC50
nM
Kd
nM
EC50/IC50
nM
koff
s-1
kon
M-1s-1
pHTemp
°C
Neurokinin 1 receptor
(Rattus norvegicus (rat))
BDBM50106386
(CHEMBL3596474)
Show SMILES FC(F)(F)c1cc(COCC2(CCNCC2)c2ccccc2)cc(c1)-c1ccc(Cl)cc1
Show InChI InChI=1S/C26H25ClF3NO/c27-24-8-6-20(7-9-24)21-14-19(15-23(16-21)26(28,29)30)17-32-18-25(10-12-31-13-11-25)22-4-2-1-3-5-22/h1-9,14-16,31H,10-13,17-18H2
Reactome pathway
n/an/a 2.80n/an/an/an/an/an/a
Bristol-Myers Squibb Co.
Curated by ChEMBL
Assay Description
Displacement of [125I]-substance P from gerbil NK1 receptor expressed in HEK293 cell membranes incubated for 30 mins by liquid scintillation counting...
Bioorg Med Chem Lett 25: 3039-43 (2015)
BindingDB Entry DOI: 10.7270/Q24M9690