BDBM50106387 CHEMBL3596475
SMILES: COC(=O)c1ccc(cc1)-c1cc(COCC2(CCNCC2)c2ccccc2)cc(c1)C(F)(F)F
InChI Key: InChIKey=GRUCCLVNQQRADI-UHFFFAOYSA-N
Data: 1 IC50
Activity Spreadsheet -- Enzyme Inhibition Constant Data from BindingDB
Found 1 hit for monomerid = 50106387
Trg + Lig
Ki
nM
ΔG°
kcal/mole
IC50
nM
Kd
nM
EC50/IC50
nM
koff
s-1
kon
M-1s-1
pHTemp
°C
Neurokinin 1 receptor
(Rattus norvegicus (rat))
BDBM50106387
(CHEMBL3596475)
Show SMILES COC(=O)c1ccc(cc1)-c1cc(COCC2(CCNCC2)c2ccccc2)cc(c1)C(F)(F)F
Show InChI InChI=1S/C28H28F3NO3/c1-34-26(33)22-9-7-21(8-10-22)23-15-20(16-25(17-23)28(29,30)31)18-35-19-27(11-13-32-14-12-27)24-5-3-2-4-6-24/h2-10,15-17,32H,11-14,18-19H2,1H3
Reactome pathway
n/an/a 17n/an/an/an/an/an/a
Bristol-Myers Squibb Co.
Curated by ChEMBL
Assay Description
Displacement of [125I]-substance P from gerbil NK1 receptor expressed in HEK293 cell membranes incubated for 30 mins by liquid scintillation counting...
Bioorg Med Chem Lett 25: 3039-43 (2015)
BindingDB Entry DOI: 10.7270/Q24M9690