null
SMILES: O=C1C=CC(=O)c2c1ccc1c2ccc2ccccc12
InChI Key: InChIKey=UORKIKBNUWJNJF-UHFFFAOYSA-N
Activity Spreadsheet -- Enzyme Inhibition Constant Data from BindingDB
Found 2 hits for monomerid = 50107004
Trg + Lig
Ki
nM
ΔG°
kcal/mole
IC50
nM
Kd
nM
EC50/IC50
nM
koff
s-1
kon
M-1s-1
pHTemp
°C
Papain
(Carica papaya)
BDBM50107004
(CHEMBL421215 | Chrysene-1,4-dione)
Show SMILES O=C1C=CC(=O)c2c1ccc1c2ccc2ccccc12 |c:2|
Show InChI InChI=1S/C18H10O2/c19-16-9-10-17(20)18-14-6-5-11-3-1-2-4-12(11)13(14)7-8-15(16)18/h1-10H
n/an/a 1.80E+4n/an/an/an/an/an/a
Merck Research Laboratories
Curated by ChEMBL
Assay Description
Inhibitory activity against papain using HPLC assay
Bioorg Med Chem Lett 11: 3143-6 (2001)
BindingDB Entry DOI: 10.7270/Q2T43SDG
Genome polyprotein
(Human rhinovirus B)
BDBM50107004
(CHEMBL421215 | Chrysene-1,4-dione)
Show SMILES O=C1C=CC(=O)c2c1ccc1c2ccc2ccccc12 |c:2|
Show InChI InChI=1S/C18H10O2/c19-16-9-10-17(20)18-14-6-5-11-3-1-2-4-12(11)13(14)7-8-15(16)18/h1-10H
n/an/a 4.65E+4n/an/an/an/an/an/a
Merck Research Laboratories
Curated by ChEMBL
Assay Description
Inhibitory activity against HRV 3Cpro using HPLC assay
Bioorg Med Chem Lett 11: 3143-6 (2001)
BindingDB Entry DOI: 10.7270/Q2T43SDG