BDBM50107260 CHEMBL3600684
SMILES: CCSc1ccc(cn1)-c1ccc2nc(N)sc2c1
InChI Key: InChIKey=PPECOBBFKIXTSR-UHFFFAOYSA-N
Data: 7 IC50
Activity Spreadsheet -- Enzyme Inhibition Constant Data from BindingDB
Found 7 hits for monomerid = 50107260
Trg + Lig
Ki
nM
ΔG°
kcal/mole
IC50
nM
Kd
nM
EC50/IC50
nM
koff
s-1
kon
M-1s-1
pHTemp
°C
Phosphatidylinositol 4,5-bisphosphate 3-kinase catalytic subunit gamma isoform
(Homo sapiens (Human))
BDBM50107260
(CHEMBL3600684)
Show SMILES CCSc1ccc(cn1)-c1ccc2nc(N)sc2c1
Show InChI InChI=1S/C14H13N3S2/c1-2-18-13-6-4-10(8-16-13)9-3-5-11-12(7-9)19-14(15)17-11/h3-8H,2H2,1H3,(H2,15,17)
NCI pathway
Reactome pathway
n/an/a 1.00E+3n/an/an/an/an/an/a
AstraZeneca
Curated by ChEMBL
Assay Description
Inhibition of PI3Kgamma (unknown origin) pre-incubated for 20 mins before phosphatidylinositol 4, 5-bisphosphate substrate addition by kinase-glo plu...
Bioorg Med Chem Lett 25: 3189-93 (2015)
BindingDB Entry DOI: 10.7270/Q2KK9DKR
Phosphatidylinositol 4,5-bisphosphate 3-kinase catalytic subunit delta isoform
(Homo sapiens (Human))
BDBM50107260
(CHEMBL3600684)
Show SMILES CCSc1ccc(cn1)-c1ccc2nc(N)sc2c1
Show InChI InChI=1S/C14H13N3S2/c1-2-18-13-6-4-10(8-16-13)9-3-5-11-12(7-9)19-14(15)17-11/h3-8H,2H2,1H3,(H2,15,17)
NCI pathway
Reactome pathway
n/an/a 2.00E+3n/an/an/an/an/an/a
AstraZeneca
Curated by ChEMBL
Assay Description
Inhibition of PI3Kdelta (unknown origin) pre-incubated for 20 mins before phosphatidylinositol 4, 5-bisphosphate substrate addition by kinase-glo plu...
Bioorg Med Chem Lett 25: 3189-93 (2015)
BindingDB Entry DOI: 10.7270/Q2KK9DKR
Phosphatidylinositol-4-phosphate 5-kinase type-1 gamma
(Homo sapiens (Human))
BDBM50107260
(CHEMBL3600684)
Show SMILES CCSc1ccc(cn1)-c1ccc2nc(N)sc2c1
Show InChI InChI=1S/C14H13N3S2/c1-2-18-13-6-4-10(8-16-13)9-3-5-11-12(7-9)19-14(15)17-11/h3-8H,2H2,1H3,(H2,15,17)
Reactome pathway
n/an/a<1.00E+5n/an/an/an/an/an/a
AstraZeneca
Curated by ChEMBL
Assay Description
Inhibition of PIP5K1C (unknown origin) using D-myo-phosphatidylinositol 4-phosphate substrate and ATP by ADP-Glo kinase Assay
Bioorg Med Chem Lett 25: 3189-93 (2015)
BindingDB Entry DOI: 10.7270/Q2KK9DKR
Phosphatidylinositol 4,5-bisphosphate 3-kinase catalytic subunit beta isoform
(Homo sapiens (Human))
BDBM50107260
(CHEMBL3600684)
Show SMILES CCSc1ccc(cn1)-c1ccc2nc(N)sc2c1
Show InChI InChI=1S/C14H13N3S2/c1-2-18-13-6-4-10(8-16-13)9-3-5-11-12(7-9)19-14(15)17-11/h3-8H,2H2,1H3,(H2,15,17)
NCI pathway
Reactome pathway
n/an/a 5.01E+3n/an/an/an/an/an/a
AstraZeneca
Curated by ChEMBL
Assay Description
Inhibition of PI3Kbeta (unknown origin) pre-incubated for 20 mins before phosphatidylinositol 4, 5-bisphosphate substrate addition by kinase-glo plus...
Bioorg Med Chem Lett 25: 3189-93 (2015)
BindingDB Entry DOI: 10.7270/Q2KK9DKR
Phosphatidylinositol 4-kinase alpha (PI4KA)
(Homo sapiens (Human))
BDBM50107260
(CHEMBL3600684)
Show SMILES CCSc1ccc(cn1)-c1ccc2nc(N)sc2c1
Show InChI InChI=1S/C14H13N3S2/c1-2-18-13-6-4-10(8-16-13)9-3-5-11-12(7-9)19-14(15)17-11/h3-8H,2H2,1H3,(H2,15,17)
n/an/a 100n/an/an/an/an/an/a
AstraZeneca
Curated by ChEMBL
Assay Description
Inhibition of N-terminal FLAG-tagged human full length recombinant PI4K3alpha using D-myo-phosphatidylinositol substrate and ATP incubated for 45 min...
Bioorg Med Chem Lett 25: 3189-93 (2015)
BindingDB Entry DOI: 10.7270/Q2KK9DKR
Phosphatidylinositol 4-kinase beta
(Homo sapiens (Human))
BDBM50107260
(CHEMBL3600684)
Show SMILES CCSc1ccc(cn1)-c1ccc2nc(N)sc2c1
Show InChI InChI=1S/C14H13N3S2/c1-2-18-13-6-4-10(8-16-13)9-3-5-11-12(7-9)19-14(15)17-11/h3-8H,2H2,1H3,(H2,15,17)
n/an/a 631n/an/an/an/an/an/a
AstraZeneca
Curated by ChEMBL
Assay Description
Inhibition of N-terminal GST-tagged human full length recombinant PI4K3beta expressed in Sf9 cells using D-myo-phosphatidylinositol substrate and ATP...
Bioorg Med Chem Lett 25: 3189-93 (2015)
BindingDB Entry DOI: 10.7270/Q2KK9DKR
Phosphatidylinositol 4,5-bisphosphate 3-kinase catalytic subunit alpha isoform
(Homo sapiens (Human))
BDBM50107260
(CHEMBL3600684)
Show SMILES CCSc1ccc(cn1)-c1ccc2nc(N)sc2c1
Show InChI InChI=1S/C14H13N3S2/c1-2-18-13-6-4-10(8-16-13)9-3-5-11-12(7-9)19-14(15)17-11/h3-8H,2H2,1H3,(H2,15,17)
NCI pathway
Reactome pathway
n/an/a 1.26E+3n/an/an/an/an/an/a
AstraZeneca
Curated by ChEMBL
Assay Description
Inhibition of PI3Kalpha (unknown origin) pre-incubated for 20 mins before phosphatidylinositol 4, 5-bisphosphate substrate addition by kinase-glo plu...
Bioorg Med Chem Lett 25: 3189-93 (2015)
BindingDB Entry DOI: 10.7270/Q2KK9DKR