BDBM50107410 3-(2,3-Dihydro-benzofuran-6-yl)-3-(2-{2-oxo-3-[2-(5,6,7,8-tetrahydro-[1,8]naphthyridin-2-yl)-ethyl]-pyrrolidin-1-yl}-acetylamino)-propionic acid::CHEMBL116273
SMILES: OC(=O)C[C@H](NC(=O)CN1CC[C@H](CCc2ccc3CCCNc3n2)C1=O)c1ccc2CCOc2c1
InChI Key: InChIKey=HTJMDVDUBVVYKB-UGKGYDQZSA-N
Data: 1 IC50
Activity Spreadsheet -- Enzyme Inhibition Constant Data from BindingDB
Found 1 hit for monomerid = 50107410
Trg + Lig
Ki
nM
ΔG°
kcal/mole
IC50
nM
Kd
nM
EC50/IC50
nM
koff
s-1
kon
M-1s-1
pHTemp
°C
ITGAV/ITGB3
(Homo sapiens (Human))
BDBM50107410
(3-(2,3-Dihydro-benzofuran-6-yl)-3-(2-{2-oxo-3-[2-(...)
Show SMILES OC(=O)C[C@H](NC(=O)CN1CC[C@H](CCc2ccc3CCCNc3n2)C1=O)c1ccc2CCOc2c1
Show InChI InChI=1S/C27H32N4O5/c32-24(30-22(15-25(33)34)20-4-3-17-10-13-36-23(17)14-20)16-31-12-9-19(27(31)35)6-8-21-7-5-18-2-1-11-28-26(18)29-21/h3-5,7,14,19,22H,1-2,6,8-13,15-16H2,(H,28,29)(H,30,32)(H,33,34)/t19-,22-/m0/s1
n/an/a 0.110n/an/an/an/an/an/a
Merck Research Laboratories
Curated by ChEMBL
Assay Description
Inhibition of high affinity radioligand binding to human alphaV-beta3 integrin
Bioorg Med Chem Lett 12: 31-4 (2001)
BindingDB Entry DOI: 10.7270/Q24J0G8R