BDBM50107451 (2R,4R)-1-[(S)-3-Hydroxy-2-(naphthalene-2-sulfonylamino)-propionyl]-4-methyl-piperidine-2-carboxylic acid (4-guanidino-butyl)-amide::CHEMBL136216
SMILES: C[C@@H]1CCN([C@H](C1)C(=O)NCCCCNC(N)=N)C(=O)[C@H](CO)NS(=O)(=O)c1ccc2ccccc2c1
InChI Key: InChIKey=XEEMSMVEWYEKLY-VOQZNFBZSA-N
Data: 1 IC50
Activity Spreadsheet -- Enzyme Inhibition Constant Data from BindingDB
Found 1 hit for monomerid = 50107451
Trg + Lig
Ki
nM
ΔG°
kcal/mole
IC50
nM
Kd
nM
EC50/IC50
nM
koff
s-1
kon
M-1s-1
pHTemp
°C
Prothrombin
(Homo sapiens (Human))
BDBM50107451
((2R,4R)-1-[(S)-3-Hydroxy-2-(naphthalene-2-sulfonyl...)
Show SMILES C[C@@H]1CCN([C@H](C1)C(=O)NCCCCNC(N)=N)C(=O)[C@H](CO)NS(=O)(=O)c1ccc2ccccc2c1
Show InChI InChI=1S/C25H36N6O5S/c1-17-10-13-31(22(14-17)23(33)28-11-4-5-12-29-25(26)27)24(34)21(16-32)30-37(35,36)20-9-8-18-6-2-3-7-19(18)15-20/h2-3,6-9,15,17,21-22,30,32H,4-5,10-14,16H2,1H3,(H,28,33)(H4,26,27,29)/t17-,21+,22-/m1/s1
n/an/a 1.70E+3n/an/an/an/an/an/a
Bristol-Myers Squibb Pharmaceutical Research Institute
Curated by ChEMBL
Assay Description
In vitro inhibition of human thrombin catalytic activity after 3 min pre incubation.
Bioorg Med Chem Lett 12: 41-4 (2001)
BindingDB Entry DOI: 10.7270/Q2MP53T0