BDBM50107453 5-Guanidino-pentanoic acid {(S)-1-[(S)-3-hydroxy-2-(naphthalene-2-sulfonylamino)-propionyl]-pyrrolidin-2-ylmethyl}-amide::CHEMBL139207
SMILES: NC(=N)NCCCCC(=O)NC[C@@H]1CCCN1C(=O)[C@H](CO)NS(=O)(=O)c1ccc2ccccc2c1
InChI Key: InChIKey=BWHDAWLDBMTRHJ-FPOVZHCZSA-N
Data: 1 IC50
Activity Spreadsheet -- Enzyme Inhibition Constant Data from BindingDB
Found 1 hit for monomerid = 50107453
Trg + Lig
Ki
nM
ΔG°
kcal/mole
IC50
nM
Kd
nM
EC50/IC50
nM
koff
s-1
kon
M-1s-1
pHTemp
°C
Prothrombin
(Homo sapiens (Human))
BDBM50107453
(5-Guanidino-pentanoic acid {(S)-1-[(S)-3-hydroxy-2...)
Show SMILES NC(=N)NCCCCC(=O)NC[C@@H]1CCCN1C(=O)[C@H](CO)NS(=O)(=O)c1ccc2ccccc2c1
Show InChI InChI=1S/C24H34N6O5S/c25-24(26)27-12-4-3-9-22(32)28-15-19-8-5-13-30(19)23(33)21(16-31)29-36(34,35)20-11-10-17-6-1-2-7-18(17)14-20/h1-2,6-7,10-11,14,19,21,29,31H,3-5,8-9,12-13,15-16H2,(H,28,32)(H4,25,26,27)/t19-,21-/m0/s1
n/an/a 80n/an/an/an/an/an/a
Bristol-Myers Squibb Pharmaceutical Research Institute
Curated by ChEMBL
Assay Description
In vitro inhibition of human thrombin catalytic activity after 3 min pre incubation.
Bioorg Med Chem Lett 12: 41-4 (2001)
BindingDB Entry DOI: 10.7270/Q2MP53T0