BDBM50107486 2-[2-(4-Fluoro-benzylsulfanyl)-5-(1-methyl-1H-pyrazol-4-ylmethyl)-4-oxo-4H-pyrimidin-1-yl]-N-methyl-N-(4'-trifluoromethyl-biphenyl-4-ylmethyl)-acetamide::CHEMBL153752
SMILES: CN(Cc1ccc(cc1)-c1ccc(cc1)C(F)(F)F)C(=O)Cn1cc(Cc2cnn(C)c2)c(=O)nc1SCc1ccc(F)cc1
InChI Key: InChIKey=RRIPEUYNUDYNBY-UHFFFAOYSA-N
Data: 1 IC50
Activity Spreadsheet -- Enzyme Inhibition Constant Data from BindingDB
Found 1 hit for monomerid = 50107486
Trg + Lig
Ki
nM
ΔG°
kcal/mole
IC50
nM
Kd
nM
EC50/IC50
nM
koff
s-1
kon
M-1s-1
pHTemp
°C
LDL-associated phospholipase A2
(Homo sapiens (Human))
BDBM50107486
(2-[2-(4-Fluoro-benzylsulfanyl)-5-(1-methyl-1H-pyra...)
Show SMILES CN(Cc1ccc(cc1)-c1ccc(cc1)C(F)(F)F)C(=O)Cn1cc(Cc2cnn(C)c2)c(=O)nc1SCc1ccc(F)cc1
Show InChI InChI=1S/C33H29F4N5O2S/c1-40(17-22-3-7-25(8-4-22)26-9-11-28(12-10-26)33(35,36)37)30(43)20-42-19-27(15-24-16-38-41(2)18-24)31(44)39-32(42)45-21-23-5-13-29(34)14-6-23/h3-14,16,18-19H,15,17,20-21H2,1-2H3
NCI pathway
Reactome pathway
n/an/a 0.700n/an/an/an/an/an/a
GlaxoSmithKline
Curated by ChEMBL
Assay Description
Inhibitory activity against recombinant human Lp-PLA2 (Lp-PLA2).
Bioorg Med Chem Lett 12: 51-5 (2001)
BindingDB Entry DOI: 10.7270/Q2862FR5