BDBM50107487 2-[2-(4-Fluoro-benzylsulfanyl)-5-(1-methyl-1H-pyrazol-4-ylmethyl)-4-oxo-4H-pyrimidin-1-yl]-N-methyl-N-(4'-methyl-biphenyl-4-ylmethyl)-acetamide::CHEMBL153142
SMILES: CN(Cc1ccc(cc1)-c1ccc(C)cc1)C(=O)Cn1cc(Cc2cnn(C)c2)c(=O)nc1SCc1ccc(F)cc1
InChI Key: InChIKey=JVEAESRBTKQMAI-UHFFFAOYSA-N
Data: 1 IC50
Activity Spreadsheet -- Enzyme Inhibition Constant Data from BindingDB
Found 1 hit for monomerid = 50107487
Trg + Lig
Ki
nM
ΔG°
kcal/mole
IC50
nM
Kd
nM
EC50/IC50
nM
koff
s-1
kon
M-1s-1
pHTemp
°C
LDL-associated phospholipase A2
(Homo sapiens (Human))
BDBM50107487
(2-[2-(4-Fluoro-benzylsulfanyl)-5-(1-methyl-1H-pyra...)
Show SMILES CN(Cc1ccc(cc1)-c1ccc(C)cc1)C(=O)Cn1cc(Cc2cnn(C)c2)c(=O)nc1SCc1ccc(F)cc1
Show InChI InChI=1S/C33H32FN5O2S/c1-23-4-10-27(11-5-23)28-12-6-24(7-13-28)18-37(2)31(40)21-39-20-29(16-26-17-35-38(3)19-26)32(41)36-33(39)42-22-25-8-14-30(34)15-9-25/h4-15,17,19-20H,16,18,21-22H2,1-3H3
NCI pathway
Reactome pathway
n/an/a 0.900n/an/an/an/an/an/a
GlaxoSmithKline
Curated by ChEMBL
Assay Description
Inhibitory activity against recombinant human Lp-PLA2 (Lp-PLA2).
Bioorg Med Chem Lett 12: 51-5 (2001)
BindingDB Entry DOI: 10.7270/Q2862FR5