BDBM50107513 CHEMBL153579::N-(2'-Chloro-biphenyl-4-ylmethyl)-2-[2-(4-fluoro-benzylsulfanyl)-5-(1-methyl-1H-pyrazol-4-ylmethyl)-4-oxo-4H-pyrimidin-1-yl]-N-methyl-acetamide
SMILES: CN(Cc1ccc(cc1)-c1ccccc1Cl)C(=O)Cn1cc(Cc2cnn(C)c2)c(=O)nc1SCc1ccc(F)cc1
InChI Key: InChIKey=BLEHHFIALXJJHU-UHFFFAOYSA-N
Data: 1 IC50
Activity Spreadsheet -- Enzyme Inhibition Constant Data from BindingDB
Found 1 hit for monomerid = 50107513
Trg + Lig
Ki
nM
ΔG°
kcal/mole
IC50
nM
Kd
nM
EC50/IC50
nM
koff
s-1
kon
M-1s-1
pHTemp
°C
LDL-associated phospholipase A2
(Homo sapiens (Human))
BDBM50107513
(CHEMBL153579 | N-(2'-Chloro-biphenyl-4-ylmethyl)-2...)
Show SMILES CN(Cc1ccc(cc1)-c1ccccc1Cl)C(=O)Cn1cc(Cc2cnn(C)c2)c(=O)nc1SCc1ccc(F)cc1
Show InChI InChI=1S/C32H29ClFN5O2S/c1-37(17-22-7-11-25(12-8-22)28-5-3-4-6-29(28)33)30(40)20-39-19-26(15-24-16-35-38(2)18-24)31(41)36-32(39)42-21-23-9-13-27(34)14-10-23/h3-14,16,18-19H,15,17,20-21H2,1-2H3
NCI pathway
Reactome pathway
n/an/a 1.60n/an/an/an/an/an/a
GlaxoSmithKline
Curated by ChEMBL
Assay Description
Inhibitory activity against recombinant human Lp-PLA2 (Lp-PLA2).
Bioorg Med Chem Lett 12: 51-5 (2001)
BindingDB Entry DOI: 10.7270/Q2862FR5