BDBM50107556 CHEMBL170493::N-{6-[2-(5-Bromo-pyrimidin-2-yloxy)-ethoxy]-2-pyridin-2-yl-5-p-tolyl-pyrimidin-4-yl}-4-tert-butyl-benzenesulfonamide
SMILES: Cc1ccc(cc1)-c1c(NS(=O)(=O)c2ccc(cc2)C(C)(C)C)nc(nc1OCCOc1ncc(Br)cn1)-c1ccccn1
InChI Key: InChIKey=CILITEGULAWVQL-UHFFFAOYSA-N
Data: 1 IC50
Activity Spreadsheet -- Enzyme Inhibition Constant Data from BindingDB
Found 1 hit for monomerid = 50107556
Trg + Lig
Ki
nM
ΔG°
kcal/mole
IC50
nM
Kd
nM
EC50/IC50
nM
koff
s-1
kon
M-1s-1
pHTemp
°C
Endothelin receptor ET-A
(Sus scrofa)
BDBM50107556
(CHEMBL170493 | N-{6-[2-(5-Bromo-pyrimidin-2-yloxy)...)
Show SMILES Cc1ccc(cc1)-c1c(NS(=O)(=O)c2ccc(cc2)C(C)(C)C)nc(nc1OCCOc1ncc(Br)cn1)-c1ccccn1
Show InChI InChI=1S/C32H31BrN6O4S/c1-21-8-10-22(11-9-21)27-29(39-44(40,41)25-14-12-23(13-15-25)32(2,3)4)37-28(26-7-5-6-16-34-26)38-30(27)42-17-18-43-31-35-19-24(33)20-36-31/h5-16,19-20H,17-18H2,1-4H3,(H,37,38,39)
Reactome pathway
n/an/a 0.0430n/an/an/an/an/an/a
Tanabe Seiyaku Co. Ltd.
Curated by ChEMBL
Assay Description
In vitro inhibition of [125 I]ET-1 binding to Endothelin A receptor in porcine aortic membrane.
Bioorg Med Chem Lett 12: 81-4 (2001)
BindingDB Entry DOI: 10.7270/Q2VX0FSC