BDBM50107604 (5Z,8Z,11Z,14Z)-(tetrahydrofuran-3-yl)methyl icosa-5,8,11,14-tetraenoate::(5Z,8Z,11Z,14Z)-Icosa-5,8,11,14-tetraenoic acid tetrahydro-furan-3-ylmethyl ester::CHEMBL287788::Icosa-5,8,11,14-tetraenoic acid tetrahydro-furan-3-ylmethyl ester
SMILES: CCCCC\C=C/C\C=C/C\C=C/C\C=C/CCCC(=O)OCC1CCOC1
InChI Key: InChIKey=GLNXMFJBGJTSIU-DOFZRALJSA-N
Data: 5 KI  3 IC50
Activity Spreadsheet -- Enzyme Inhibition Constant Data from BindingDB
Found 8 hits for monomerid = 50107604
Trg + Lig
Ki
nM
ΔG°
kcal/mole
IC50
nM
Kd
nM
EC50/IC50
nM
koff
s-1
kon
M-1s-1
pHTemp
°C
Cannabinoid receptor 2
(Homo sapiens (Human))
BDBM50107604
((5Z,8Z,11Z,14Z)-(tetrahydrofuran-3-yl)methyl icosa...)
Show SMILES CCCCC\C=C/C\C=C/C\C=C/C\C=C/CCCC(=O)OCC1CCOC1
Show InChI InChI=1S/C25H40O3/c1-2-3-4-5-6-7-8-9-10-11-12-13-14-15-16-17-18-19-25(26)28-23-24-20-21-27-22-24/h6-7,9-10,12-13,15-16,24H,2-5,8,11,14,17-23H2,1H3/b7-6-,10-9-,13-12-,16-15-
Reactome pathway
>1.00E+3n/an/an/an/an/an/an/an/a
Universidad Complutense
Curated by ChEMBL
Assay Description
Binding affinity to human CB2 cannabinoid receptor using [3H]CP-55940 in HEK293 EBNA transfected cells
J Med Chem 44: 4505-8 (2001)
BindingDB Entry DOI: 10.7270/Q29G5NJ5
Vanilloid receptor
(Rattus norvegicus (rat))
BDBM50107604
((5Z,8Z,11Z,14Z)-(tetrahydrofuran-3-yl)methyl icosa...)
Show SMILES CCCCC\C=C/C\C=C/C\C=C/C\C=C/CCCC(=O)OCC1CCOC1
Show InChI InChI=1S/C25H40O3/c1-2-3-4-5-6-7-8-9-10-11-12-13-14-15-16-17-18-19-25(26)28-23-24-20-21-27-22-24/h6-7,9-10,12-13,15-16,24H,2-5,8,11,14,17-23H2,1H3/b7-6-,10-9-,13-12-,16-15-
Reactome pathway
>5.00E+3n/an/an/an/an/an/an/an/a
Universidad Complutense
Curated by ChEMBL
Assay Description
Binding affinity to vanilloid VR1 receptor using [3H]resiniferatoxin ([3H]-RTX) in rat spinal cord membranes
J Med Chem 44: 4505-8 (2001)
BindingDB Entry DOI: 10.7270/Q29G5NJ5
Vanilloid receptor
(Rattus norvegicus (rat))
BDBM50107604
((5Z,8Z,11Z,14Z)-(tetrahydrofuran-3-yl)methyl icosa...)
Show SMILES CCCCC\C=C/C\C=C/C\C=C/C\C=C/CCCC(=O)OCC1CCOC1
Show InChI InChI=1S/C25H40O3/c1-2-3-4-5-6-7-8-9-10-11-12-13-14-15-16-17-18-19-25(26)28-23-24-20-21-27-22-24/h6-7,9-10,12-13,15-16,24H,2-5,8,11,14,17-23H2,1H3/b7-6-,10-9-,13-12-,16-15-
Reactome pathway
>5.00E+3n/an/an/an/an/an/an/an/a
Universidad Complutense
Curated by ChEMBL
Assay Description
Binding affinity against vanilloid receptor 1 (VR1) using [3H]RTX in rat spinal cord membranes
J Med Chem 46: 1512-22 (2003)
Article DOI: 10.1021/jm0210818
BindingDB Entry DOI: 10.7270/Q2GQ6ZHS
Cannabinoid receptor 1
(Rattus norvegicus (rat))
BDBM50107604
((5Z,8Z,11Z,14Z)-(tetrahydrofuran-3-yl)methyl icosa...)
Show SMILES CCCCC\C=C/C\C=C/C\C=C/C\C=C/CCCC(=O)OCC1CCOC1
Show InChI InChI=1S/C25H40O3/c1-2-3-4-5-6-7-8-9-10-11-12-13-14-15-16-17-18-19-25(26)28-23-24-20-21-27-22-24/h6-7,9-10,12-13,15-16,24H,2-5,8,11,14,17-23H2,1H3/b7-6-,10-9-,13-12-,16-15-
Reactome pathway
>5.00E+3n/an/an/an/an/an/an/an/a
Universidad Complutense
Curated by ChEMBL
Assay Description
Binding affinity against G protein coupled Cannabinoid receptor 1 using [3H]WIN-55212-2 in rat cerebellum membranes
J Med Chem 46: 1512-22 (2003)
Article DOI: 10.1021/jm0210818
BindingDB Entry DOI: 10.7270/Q2GQ6ZHS
Cannabinoid receptor 2
(Homo sapiens (Human))
BDBM50107604
((5Z,8Z,11Z,14Z)-(tetrahydrofuran-3-yl)methyl icosa...)
Show SMILES CCCCC\C=C/C\C=C/C\C=C/C\C=C/CCCC(=O)OCC1CCOC1
Show InChI InChI=1S/C25H40O3/c1-2-3-4-5-6-7-8-9-10-11-12-13-14-15-16-17-18-19-25(26)28-23-24-20-21-27-22-24/h6-7,9-10,12-13,15-16,24H,2-5,8,11,14,17-23H2,1H3/b7-6-,10-9-,13-12-,16-15-
Reactome pathway
>1.00E+4n/an/an/an/an/an/an/an/a
Universidad Complutense
Curated by ChEMBL
Assay Description
Binding affinity against G protein coupled human Cannabinoid receptor 2 using [3H]CP-55940 in HEK293 EBNA transfected cells
J Med Chem 46: 1512-22 (2003)
Article DOI: 10.1021/jm0210818
BindingDB Entry DOI: 10.7270/Q2GQ6ZHS
Fatty-acid amide hydrolase 1 (aa 30-579)
(Rattus norvegicus (rat))
BDBM50107604
((5Z,8Z,11Z,14Z)-(tetrahydrofuran-3-yl)methyl icosa...)
Show SMILES CCCCC\C=C/C\C=C/C\C=C/C\C=C/CCCC(=O)OCC1CCOC1
Show InChI InChI=1S/C25H40O3/c1-2-3-4-5-6-7-8-9-10-11-12-13-14-15-16-17-18-19-25(26)28-23-24-20-21-27-22-24/h6-7,9-10,12-13,15-16,24H,2-5,8,11,14,17-23H2,1H3/b7-6-,10-9-,13-12-,16-15-
n/an/a 1.13E+5n/an/an/an/an/an/a
Universidad Complutense
Curated by ChEMBL
Assay Description
Inhibition of fatty acid amide hydrolase (FAAH) was determined using rat brain homogenates as the enzyme source and [3H]anandamide as substrate
J Med Chem 46: 1512-22 (2003)
Article DOI: 10.1021/jm0210818
BindingDB Entry DOI: 10.7270/Q2GQ6ZHS
Monoglyceride lipase (MGL)
(Rattus norvegicus (Rat))
BDBM50107604
((5Z,8Z,11Z,14Z)-(tetrahydrofuran-3-yl)methyl icosa...)
Show SMILES CCCCC\C=C/C\C=C/C\C=C/C\C=C/CCCC(=O)OCC1CCOC1
Show InChI InChI=1S/C25H40O3/c1-2-3-4-5-6-7-8-9-10-11-12-13-14-15-16-17-18-19-25(26)28-23-24-20-21-27-22-24/h6-7,9-10,12-13,15-16,24H,2-5,8,11,14,17-23H2,1H3/b7-6-,10-9-,13-12-,16-15-
Reactome pathway
n/an/a 4.30E+4n/an/an/an/an/an/a
Universidad Complutense
Curated by ChEMBL
Assay Description
Inhibition of MGL in rat cerebellum cytosolic fractions assessed as [3H]-2-oleoglycerol hydrolysis
J Med Chem 50: 5012-23 (2007)
Article DOI: 10.1021/jm070642y
BindingDB Entry DOI: 10.7270/Q2N879HC
Fatty-acid amide hydrolase 1 (aa 30-579)
(Rattus norvegicus (rat))
BDBM50107604
((5Z,8Z,11Z,14Z)-(tetrahydrofuran-3-yl)methyl icosa...)
Show SMILES CCCCC\C=C/C\C=C/C\C=C/C\C=C/CCCC(=O)OCC1CCOC1
Show InChI InChI=1S/C25H40O3/c1-2-3-4-5-6-7-8-9-10-11-12-13-14-15-16-17-18-19-25(26)28-23-24-20-21-27-22-24/h6-7,9-10,12-13,15-16,24H,2-5,8,11,14,17-23H2,1H3/b7-6-,10-9-,13-12-,16-15-
n/an/a 1.10E+4n/an/an/an/an/an/a
Universidad Complutense
Curated by ChEMBL
Assay Description
Inhibition of FAAH in rat cerebellum membranes assessed as [3H]anandamide hydrolysis
J Med Chem 50: 5012-23 (2007)
Article DOI: 10.1021/jm070642y
BindingDB Entry DOI: 10.7270/Q2N879HC