null
SMILES: Clc1ccc(cc1)-c1ccc(cc1)C(=O)NCCc1ccc(CN2CCCCC2)cc1
InChI Key: InChIKey=NYDXOPYTOGGQKB-UHFFFAOYSA-N
Activity Spreadsheet -- Enzyme Inhibition Constant Data from BindingDB
Found 1 hit for monomerid = 50107760
Trg + Lig
Ki
nM
ΔG°
kcal/mole
IC50
nM
Kd
nM
EC50/IC50
nM
koff
s-1
kon
M-1s-1
pHTemp
°C
Melanin-concentrating hormone receptor 1
(Homo sapiens (Human))
BDBM50107760
(CHEMBL3600803)
Show SMILES Clc1ccc(cc1)-c1ccc(cc1)C(=O)NCCc1ccc(CN2CCCCC2)cc1
Show InChI InChI=1S/C27H29ClN2O/c28-26-14-12-24(13-15-26)23-8-10-25(11-9-23)27(31)29-17-16-21-4-6-22(7-5-21)20-30-18-2-1-3-19-30/h4-15H,1-3,16-20H2,(H,29,31)
Reactome pathway
n/an/a 2n/an/an/an/an/an/a
Boehringer Ingelheim Pharma GmbH& Co. KG
Curated by ChEMBL
Assay Description
Displacement of [125I]-MCH from human MCHR1 expressed in CHO/Galpha16 cell membranes by scintillation counting method
Bioorg Med Chem Lett 25: 3264-9 (2015)
BindingDB Entry DOI: 10.7270/Q25D8TMB