BDBM50107764 CHEMBL3600807
SMILES: Clc1ccc(cc1)-c1ccc(cc1)C(=O)NCCc1ccc(CN2CCCC2)cc1Br
InChI Key: InChIKey=VUEXAULJDGRSPZ-UHFFFAOYSA-N
Data: 1 IC50
Activity Spreadsheet -- Enzyme Inhibition Constant Data from BindingDB
Found 1 hit for monomerid = 50107764
Trg + Lig
Ki
nM
ΔG°
kcal/mole
IC50
nM
Kd
nM
EC50/IC50
nM
koff
s-1
kon
M-1s-1
pHTemp
°C
Melanin-concentrating hormone receptor 1
(Homo sapiens (Human))
BDBM50107764
(CHEMBL3600807)
Show SMILES Clc1ccc(cc1)-c1ccc(cc1)C(=O)NCCc1ccc(CN2CCCC2)cc1Br
Show InChI InChI=1S/C26H26BrClN2O/c27-25-17-19(18-30-15-1-2-16-30)3-4-22(25)13-14-29-26(31)23-7-5-20(6-8-23)21-9-11-24(28)12-10-21/h3-12,17H,1-2,13-16,18H2,(H,29,31)
Reactome pathway
n/an/a 2n/an/an/an/an/an/a
Boehringer Ingelheim Pharma GmbH& Co. KG
Curated by ChEMBL
Assay Description
Displacement of [125I]-MCH from human MCHR1 expressed in CHO/Galpha16 cell membranes by scintillation counting method
Bioorg Med Chem Lett 25: 3264-9 (2015)
BindingDB Entry DOI: 10.7270/Q25D8TMB