BDBM50107780 6-Methyl-4'-trifluoromethyl-biphenyl-2-carboxylic acid (2-methanesulfonylamino-indan-5-yl)-amide::CHEMBL142763
SMILES: Cc1cccc(C(=O)Nc2ccc3C[C@@H](Cc3c2)NS(C)(=O)=O)c1-c1ccc(cc1)C(F)(F)F
InChI Key: InChIKey=PMXMADULYZHDGE-NRFANRHFSA-N
Data: 2 IC50
Activity Spreadsheet -- Enzyme Inhibition Constant Data from BindingDB
Found 2 hits for monomerid = 50107780
Trg + Lig
Ki
nM
ΔG°
kcal/mole
IC50
nM
Kd
nM
EC50/IC50
nM
koff
s-1
kon
M-1s-1
pHTemp
°C
Apolipoprotein B-100
(Homo sapiens (Human))
BDBM50107780
(6-Methyl-4'-trifluoromethyl-biphenyl-2-carboxylic ...)
Show SMILES Cc1cccc(C(=O)Nc2ccc3C[C@@H](Cc3c2)NS(C)(=O)=O)c1-c1ccc(cc1)C(F)(F)F
Show InChI InChI=1S/C25H23F3N2O3S/c1-15-4-3-5-22(23(15)16-6-9-19(10-7-16)25(26,27)28)24(31)29-20-11-8-17-12-21(14-18(17)13-20)30-34(2,32)33/h3-11,13,21,30H,12,14H2,1-2H3,(H,29,31)/t21-/m0/s1
NCI pathway
Reactome pathway
n/an/a 8.80n/an/an/an/an/an/a
Novartis Institute for Biomedical Reasearch
Curated by ChEMBL
Assay Description
Inhibition of apolipoprotein B (apoB) secreted by human hepatoma cells (Hep G2) at 100 nM
J Med Chem 44: 4677-87 (2001)
BindingDB Entry DOI: 10.7270/Q23F4NXH
Microsomal triglyceride transfer protein
(Homo sapiens (Human))
BDBM50107780
(6-Methyl-4'-trifluoromethyl-biphenyl-2-carboxylic ...)
Show SMILES Cc1cccc(C(=O)Nc2ccc3C[C@@H](Cc3c2)NS(C)(=O)=O)c1-c1ccc(cc1)C(F)(F)F
Show InChI InChI=1S/C25H23F3N2O3S/c1-15-4-3-5-22(23(15)16-6-9-19(10-7-16)25(26,27)28)24(31)29-20-11-8-17-12-21(14-18(17)13-20)30-34(2,32)33/h3-11,13,21,30H,12,14H2,1-2H3,(H,29,31)/t21-/m0/s1
Reactome pathway
n/an/a 204n/an/an/an/an/an/a
Novartis Institute for Biomedical Reasearch
Curated by ChEMBL
Assay Description
In vitro inhibitory activity against MTP using MTP transfer assay
J Med Chem 44: 4677-87 (2001)
BindingDB Entry DOI: 10.7270/Q23F4NXH