BDBM50107796 4'-Trifluoromethyl-biphenyl-2-carboxylic acid (2-acetylamino-indan-5-yl)-amide::CHEMBL143610
SMILES: CC(=O)NC1Cc2ccc(NC(=O)c3ccccc3-c3ccc(cc3)C(F)(F)F)cc2C1
InChI Key: InChIKey=LDMOLCOFCNCFPU-UHFFFAOYSA-N
Data: 2 IC50
Activity Spreadsheet -- Enzyme Inhibition Constant Data from BindingDB
Found 2 hits for monomerid = 50107796
Trg + Lig
Ki
nM
ΔG°
kcal/mole
IC50
nM
Kd
nM
EC50/IC50
nM
koff
s-1
kon
M-1s-1
pHTemp
°C
Microsomal triglyceride transfer protein
(Homo sapiens (Human))
BDBM50107796
(4'-Trifluoromethyl-biphenyl-2-carboxylic acid (2-a...)
Show SMILES CC(=O)NC1Cc2ccc(NC(=O)c3ccccc3-c3ccc(cc3)C(F)(F)F)cc2C1
Show InChI InChI=1S/C25H21F3N2O2/c1-15(31)29-21-12-17-8-11-20(13-18(17)14-21)30-24(32)23-5-3-2-4-22(23)16-6-9-19(10-7-16)25(26,27)28/h2-11,13,21H,12,14H2,1H3,(H,29,31)(H,30,32)
Reactome pathway
n/an/a 80n/an/an/an/an/an/a
Novartis Institute for Biomedical Reasearch
Curated by ChEMBL
Assay Description
In vitro inhibitory activity against MTP using MTP transfer assay
J Med Chem 44: 4677-87 (2001)
BindingDB Entry DOI: 10.7270/Q23F4NXH
Apolipoprotein B-100
(Homo sapiens (Human))
BDBM50107796
(4'-Trifluoromethyl-biphenyl-2-carboxylic acid (2-a...)
Show SMILES CC(=O)NC1Cc2ccc(NC(=O)c3ccccc3-c3ccc(cc3)C(F)(F)F)cc2C1
Show InChI InChI=1S/C25H21F3N2O2/c1-15(31)29-21-12-17-8-11-20(13-18(17)14-21)30-24(32)23-5-3-2-4-22(23)16-6-9-19(10-7-16)25(26,27)28/h2-11,13,21H,12,14H2,1H3,(H,29,31)(H,30,32)
NCI pathway
Reactome pathway
n/an/a 120n/an/an/an/an/an/a
Novartis Institute for Biomedical Reasearch
Curated by ChEMBL
Assay Description
Inhibition of apolipoprotein B (apoB) secreted by human hepatoma cells (Hep G2) at 100 nM
J Med Chem 44: 4677-87 (2001)
BindingDB Entry DOI: 10.7270/Q23F4NXH