BDBM50107802 4'-Chloro-6-methoxy-biphenyl-2-carboxylic acid (2-benzenesulfonylamino-indan-5-yl)-amide::CHEMBL343406
SMILES: COc1cccc(C(=O)Nc2ccc3CC(Cc3c2)NS(=O)(=O)c2ccccc2)c1-c1ccc(Cl)cc1
InChI Key: InChIKey=DPKBSACUADFSQG-UHFFFAOYSA-N
Data: 2 IC50
Activity Spreadsheet -- Enzyme Inhibition Constant Data from BindingDB
Found 2 hits for monomerid = 50107802
Trg + Lig
Ki
nM
ΔG°
kcal/mole
IC50
nM
Kd
nM
EC50/IC50
nM
koff
s-1
kon
M-1s-1
pHTemp
°C
Apolipoprotein B-100
(Homo sapiens (Human))
BDBM50107802
(4'-Chloro-6-methoxy-biphenyl-2-carboxylic acid (2-...)
Show SMILES COc1cccc(C(=O)Nc2ccc3CC(Cc3c2)NS(=O)(=O)c2ccccc2)c1-c1ccc(Cl)cc1
Show InChI InChI=1S/C29H25ClN2O4S/c1-36-27-9-5-8-26(28(27)19-10-13-22(30)14-11-19)29(33)31-23-15-12-20-16-24(18-21(20)17-23)32-37(34,35)25-6-3-2-4-7-25/h2-15,17,24,32H,16,18H2,1H3,(H,31,33)
NCI pathway
Reactome pathway
n/an/a 2n/an/an/an/an/an/a
Novartis Institute for Biomedical Reasearch
Curated by ChEMBL
Assay Description
Inhibition of apolipoprotein B (apoB) secreted by human hepatoma cells (Hep G2) at 100 nM
J Med Chem 44: 4677-87 (2001)
BindingDB Entry DOI: 10.7270/Q23F4NXH
Microsomal triglyceride transfer protein large subunit
(Homo sapiens (Human))
BDBM50107802
(4'-Chloro-6-methoxy-biphenyl-2-carboxylic acid (2-...)
Show SMILES COc1cccc(C(=O)Nc2ccc3CC(Cc3c2)NS(=O)(=O)c2ccccc2)c1-c1ccc(Cl)cc1
Show InChI InChI=1S/C29H25ClN2O4S/c1-36-27-9-5-8-26(28(27)19-10-13-22(30)14-11-19)29(33)31-23-15-12-20-16-24(18-21(20)17-23)32-37(34,35)25-6-3-2-4-7-25/h2-15,17,24,32H,16,18H2,1H3,(H,31,33)
Reactome pathway
n/an/a 110n/an/an/an/an/an/a
Novartis Institute for Biomedical Reasearch
Curated by ChEMBL
Assay Description
In vitro inhibitory activity against MTP using MTP transfer assay
J Med Chem 44: 4677-87 (2001)
BindingDB Entry DOI: 10.7270/Q23F4NXH