BDBM50107818 CHEMBL3600811
SMILES: Fc1cc(ccc1-c1ccc(Cl)cc1)C(=O)NCCc1ccc(CN2CCCC2)cc1
InChI Key: InChIKey=JZGDBPYGQVLLBI-UHFFFAOYSA-N
Data: 1 IC50
Activity Spreadsheet -- Enzyme Inhibition Constant Data from BindingDB
Found 1 hit for monomerid = 50107818
Trg + Lig
Ki
nM
ΔG°
kcal/mole
IC50
nM
Kd
nM
EC50/IC50
nM
koff
s-1
kon
M-1s-1
pHTemp
°C
Melanin-concentrating hormone receptor
(Homo sapiens (Human))
BDBM50107818
(CHEMBL3600811)
Show SMILES Fc1cc(ccc1-c1ccc(Cl)cc1)C(=O)NCCc1ccc(CN2CCCC2)cc1
Show InChI InChI=1S/C26H26ClFN2O/c27-23-10-7-21(8-11-23)24-12-9-22(17-25(24)28)26(31)29-14-13-19-3-5-20(6-4-19)18-30-15-1-2-16-30/h3-12,17H,1-2,13-16,18H2,(H,29,31)
Reactome pathway
n/an/a 1n/an/an/an/an/an/a
Boehringer Ingelheim Pharma GmbH& Co. KG
Curated by ChEMBL
Assay Description
Displacement of [125I]-MCH from human MCHR1 expressed in CHO/Galpha16 cell membranes by scintillation counting method
Bioorg Med Chem Lett 25: 3264-9 (2015)
BindingDB Entry DOI: 10.7270/Q25D8TMB