BDBM50108299 CHEMBL288229::Indolocarbazole analogue
SMILES: CCSCc1ccc2n3c4c(c5CNC(=O)c5c5c6ccccc6n([C@H]6C[C@](O)(C(=O)OC)[C@]3(C)O6)c45)c2c1
InChI Key: InChIKey=UFLRHQRKTYVKGB-YCIRJXQPSA-N
Data: 5 IC50
Activity Spreadsheet -- Enzyme Inhibition Constant Data from BindingDB
Found 5 hits for monomerid = 50108299
Trg + Lig
Ki
nM
ΔG°
kcal/mole
IC50
nM
Kd
nM
EC50/IC50
nM
koff
s-1
kon
M-1s-1
pHTemp
°C
Mitogen-activated protein kinase kinase kinase 10
(Homo sapiens (Human))
BDBM50108299
(CHEMBL288229 | Indolocarbazole analogue)
Show SMILES CCSCc1ccc2n3c4c(c5CNC(=O)c5c5c6ccccc6n([C@H]6C[C@](O)(C(=O)OC)[C@]3(C)O6)c45)c2c1
Show InChI InChI=1S/C30H27N3O5S/c1-4-39-14-15-9-10-20-17(11-15)22-18-13-31-27(34)24(18)23-16-7-5-6-8-19(16)32-21-12-30(36,28(35)37-3)29(2,38-21)33(20)26(22)25(23)32/h5-11,21,36H,4,12-14H2,1-3H3,(H,31,34)/t21?,29-,30-/m0/s1
NCI pathway
n/an/a 28n/an/an/an/an/an/a
Kyowa-Hakko Kogyo Co., Ltd.
Curated by ChEMBL
Assay Description
Inhibition of Mixed lineage kinase 2(MLK2)
Bioorg Med Chem Lett 12: 147-50 (2001)
BindingDB Entry DOI: 10.7270/Q2571B94
High affinity nerve growth factor receptor
(Homo sapiens (Human))
BDBM50108299
(CHEMBL288229 | Indolocarbazole analogue)
Show SMILES CCSCc1ccc2n3c4c(c5CNC(=O)c5c5c6ccccc6n([C@H]6C[C@](O)(C(=O)OC)[C@]3(C)O6)c45)c2c1
Show InChI InChI=1S/C30H27N3O5S/c1-4-39-14-15-9-10-20-17(11-15)22-18-13-31-27(34)24(18)23-16-7-5-6-8-19(16)32-21-12-30(36,28(35)37-3)29(2,38-21)33(20)26(22)25(23)32/h5-11,21,36H,4,12-14H2,1-3H3,(H,31,34)/t21?,29-,30-/m0/s1
n/an/a 61n/an/an/an/an/an/a
Kyowa-Hakko Kogyo Co., Ltd.
Curated by ChEMBL
Assay Description
Inhibition of NGF high affinity receptor tyrosine kinase TrkA
Bioorg Med Chem Lett 12: 147-50 (2001)
BindingDB Entry DOI: 10.7270/Q2571B94
Protein kinase C (PKC)
(Rattus norvegicus-Rattus norvegicus (Rat)-Rattus n...)
BDBM50108299
(CHEMBL288229 | Indolocarbazole analogue)
Show SMILES CCSCc1ccc2n3c4c(c5CNC(=O)c5c5c6ccccc6n([C@H]6C[C@](O)(C(=O)OC)[C@]3(C)O6)c45)c2c1
Show InChI InChI=1S/C30H27N3O5S/c1-4-39-14-15-9-10-20-17(11-15)22-18-13-31-27(34)24(18)23-16-7-5-6-8-19(16)32-21-12-30(36,28(35)37-3)29(2,38-21)33(20)26(22)25(23)32/h5-11,21,36H,4,12-14H2,1-3H3,(H,31,34)/t21?,29-,30-/m0/s1
n/an/a 400n/an/an/an/an/an/a
Kyowa-Hakko Kogyo Co., Ltd.
Curated by ChEMBL
Assay Description
Binding affinity towards 5-hydroxytryptamine 3 receptor
Bioorg Med Chem Lett 12: 147-50 (2001)
BindingDB Entry DOI: 10.7270/Q2571B94
Mitogen-activated protein kinase kinase kinase 9 (MLK1)
(Homo sapiens (Human))
BDBM50108299
(CHEMBL288229 | Indolocarbazole analogue)
Show SMILES CCSCc1ccc2n3c4c(c5CNC(=O)c5c5c6ccccc6n([C@H]6C[C@](O)(C(=O)OC)[C@]3(C)O6)c45)c2c1
Show InChI InChI=1S/C30H27N3O5S/c1-4-39-14-15-9-10-20-17(11-15)22-18-13-31-27(34)24(18)23-16-7-5-6-8-19(16)32-21-12-30(36,28(35)37-3)29(2,38-21)33(20)26(22)25(23)32/h5-11,21,36H,4,12-14H2,1-3H3,(H,31,34)/t21?,29-,30-/m0/s1
n/an/a 28n/an/an/an/an/an/a
Kyowa-Hakko Kogyo Co., Ltd.
Curated by ChEMBL
Assay Description
Inhibition of Mixed lineage kinase 1 (MLK1)
Bioorg Med Chem Lett 12: 147-50 (2001)
BindingDB Entry DOI: 10.7270/Q2571B94
Mitogen-activated protein kinase kinase kinase 11
(Homo sapiens (Human))
BDBM50108299
(CHEMBL288229 | Indolocarbazole analogue)
Show SMILES CCSCc1ccc2n3c4c(c5CNC(=O)c5c5c6ccccc6n([C@H]6C[C@](O)(C(=O)OC)[C@]3(C)O6)c45)c2c1
Show InChI InChI=1S/C30H27N3O5S/c1-4-39-14-15-9-10-20-17(11-15)22-18-13-31-27(34)24(18)23-16-7-5-6-8-19(16)32-21-12-30(36,28(35)37-3)29(2,38-21)33(20)26(22)25(23)32/h5-11,21,36H,4,12-14H2,1-3H3,(H,31,34)/t21?,29-,30-/m0/s1
NCI pathway
n/an/a 21n/an/an/an/an/an/a
Kyowa-Hakko Kogyo Co., Ltd.
Curated by ChEMBL
Assay Description
Inhibition of Mixed lineage kinase 3 (MLK3)
Bioorg Med Chem Lett 12: 147-50 (2001)
BindingDB Entry DOI: 10.7270/Q2571B94