BDBM50108333 (S)-2-{[(S)-1-(3,5-Dichloro-benzenesulfonyl)-pyrrolidine-2-carbonyl]-amino}-3-[4-(1H-tetrazol-5-ylmethoxy)-phenyl]-propionic acid::CHEMBL289276
SMILES: OC(=O)[C@H](Cc1ccc(OCc2nnn[nH]2)cc1)NC(=O)[C@@H]1CCCN1S(=O)(=O)c1cc(Cl)cc(Cl)c1
InChI Key: InChIKey=IGRGIQWZKAUHDT-OALUTQOASA-N
Data: 2 IC50
Activity Spreadsheet -- Enzyme Inhibition Constant Data from BindingDB
Found 2 hits for monomerid = 50108333
Trg + Lig
Ki
nM
ΔG°
kcal/mole
IC50
nM
Kd
nM
EC50/IC50
nM
koff
s-1
kon
M-1s-1
pHTemp
°C
Integrin α4β7
(Homo sapiens (Human))
BDBM50108333
((S)-2-{[(S)-1-(3,5-Dichloro-benzenesulfonyl)-pyrro...)
Show SMILES OC(=O)[C@H](Cc1ccc(OCc2nnn[nH]2)cc1)NC(=O)[C@@H]1CCCN1S(=O)(=O)c1cc(Cl)cc(Cl)c1
Show InChI InChI=1S/C22H22Cl2N6O6S/c23-14-9-15(24)11-17(10-14)37(34,35)30-7-1-2-19(30)21(31)25-18(22(32)33)8-13-3-5-16(6-4-13)36-12-20-26-28-29-27-20/h3-6,9-11,18-19H,1-2,7-8,12H2,(H,25,31)(H,32,33)(H,26,27,28,29)/t18-,19-/m0/s1
NCI pathway
Reactome pathway
n/an/a 166n/an/an/an/an/an/a
Merck Research Laboratories
Curated by ChEMBL
Assay Description
Alpha4-beta7 integrin binding affinity was determined in duplicate by a radioligand binding assay using [125I]-VCAM-Ig and a suspension of RPMI-8866 ...
Bioorg Med Chem Lett 12: 159-63 (2001)
BindingDB Entry DOI: 10.7270/Q2WS8SJB
Fibronectin receptor beta/Integrin alpha-4
(Homo sapiens (Human))
BDBM50108333
((S)-2-{[(S)-1-(3,5-Dichloro-benzenesulfonyl)-pyrro...)
Show SMILES OC(=O)[C@H](Cc1ccc(OCc2nnn[nH]2)cc1)NC(=O)[C@@H]1CCCN1S(=O)(=O)c1cc(Cl)cc(Cl)c1
Show InChI InChI=1S/C22H22Cl2N6O6S/c23-14-9-15(24)11-17(10-14)37(34,35)30-7-1-2-19(30)21(31)25-18(22(32)33)8-13-3-5-16(6-4-13)36-12-20-26-28-29-27-20/h3-6,9-11,18-19H,1-2,7-8,12H2,(H,25,31)(H,32,33)(H,26,27,28,29)/t18-,19-/m0/s1
Reactome pathway
n/an/a 0.210n/an/an/an/an/an/a
Merck Research Laboratories
Curated by ChEMBL
Assay Description
Alpha4-beta1 integrin binding affinity was assessed by measuring the reduction in binding of [125I]VCAM-Ig to a suspension of Jurkat cells (a human T...
Bioorg Med Chem Lett 12: 159-63 (2001)
BindingDB Entry DOI: 10.7270/Q2WS8SJB