BDBM50108512 5-(4,8,12-Trimethyl-tridecyl)-3a,4,7,7a-tetrahydro-isobenzofuran-1,3-dione::CHEMBL86535
SMILES: CC(C)CCCC(C)CCCC(C)CCCC1=CCC2C(C1)C(=O)OC2=O
InChI Key: InChIKey=UJZSKNNWYHCFEO-UHFFFAOYSA-N
Data: 2 IC50
Activity Spreadsheet -- Enzyme Inhibition Constant Data from BindingDB
Found 2 hits for monomerid = 50108512
Trg + Lig
Ki
nM
ΔG°
kcal/mole
IC50
nM
Kd
nM
EC50/IC50
nM
koff
s-1
kon
M-1s-1
pHTemp
°C
Protein Farnesyltransferase (PFT)
(Homo sapiens (Human))
BDBM50108512
(5-(4,8,12-Trimethyl-tridecyl)-3a,4,7,7a-tetrahydro...)
Show SMILES CC(C)CCCC(C)CCCC(C)CCCC1=CCC2C(C1)C(=O)OC2=O |t:16|
Show InChI InChI=1S/C24H40O3/c1-17(2)8-5-9-18(3)10-6-11-19(4)12-7-13-20-14-15-21-22(16-20)24(26)27-23(21)25/h14,17-19,21-22H,5-13,15-16H2,1-4H3
Reactome pathway
n/an/a>1.00E+6n/an/an/an/an/an/a
University College London
Curated by ChEMBL
Assay Description
In vitro inhibition of farnesyl-protein transferase
Bioorg Med Chem Lett 12: 255-9 (2001)
BindingDB Entry DOI: 10.7270/Q2GQ6Z93
Geranylgeranyl transferase type I beta subunit/Protein Farnesyltransferase (PFT)
(Homo sapiens (Human))
BDBM50108512
(5-(4,8,12-Trimethyl-tridecyl)-3a,4,7,7a-tetrahydro...)
Show SMILES CC(C)CCCC(C)CCCC(C)CCCC1=CCC2C(C1)C(=O)OC2=O |t:16|
Show InChI InChI=1S/C24H40O3/c1-17(2)8-5-9-18(3)10-6-11-19(4)12-7-13-20-14-15-21-22(16-20)24(26)27-23(21)25/h14,17-19,21-22H,5-13,15-16H2,1-4H3
n/an/a 2.08E+4n/an/an/an/an/an/a
University College London
Curated by ChEMBL
Assay Description
Binding affinity for human cloned 5-hydroxytryptamine 3 receptor
Bioorg Med Chem Lett 12: 255-9 (2001)
BindingDB Entry DOI: 10.7270/Q2GQ6Z93