BDBM50108648 CHEMBL3596511
SMILES: COc1ccccc1N1CCN(Cc2nc3c4cccc(OC)c4nc(N)n3n2)[C@H](C)C1
InChI Key: InChIKey=AVHLJSGXVGYCKK-OAHLLOKOSA-N
Data: 2 KI  1 IC50
Activity Spreadsheet -- Enzyme Inhibition Constant Data from BindingDB
Found 3 hits for monomerid = 50108648
Trg + Lig
Ki
nM
ΔG°
kcal/mole
IC50
nM
Kd
nM
EC50/IC50
nM
koff
s-1
kon
M-1s-1
pHTemp
°C
Adenosine receptor A2a
(Homo sapiens (Human))
BDBM50108648
(CHEMBL3596511)
Show SMILES COc1ccccc1N1CCN(Cc2nc3c4cccc(OC)c4nc(N)n3n2)[C@H](C)C1 |r|
Show InChI InChI=1S/C23H27N7O2/c1-15-13-29(17-8-4-5-9-18(17)31-2)12-11-28(15)14-20-25-22-16-7-6-10-19(32-3)21(16)26-23(24)30(22)27-20/h4-10,15H,11-14H2,1-3H3,(H2,24,26)/t15-/m1/s1
NCI pathway
Reactome pathway
8.90n/an/an/an/an/an/an/an/a
Merck Research Laboratories
Curated by ChEMBL
Assay Description
Inhibition of human adenosine A2A receptor
Bioorg Med Chem Lett 25: 2958-62 (2015)
BindingDB Entry DOI: 10.7270/Q23F4RFG
Adenosine receptor A1
(Homo sapiens (Human))
BDBM50108648
(CHEMBL3596511)
Show SMILES COc1ccccc1N1CCN(Cc2nc3c4cccc(OC)c4nc(N)n3n2)[C@H](C)C1 |r|
Show InChI InChI=1S/C23H27N7O2/c1-15-13-29(17-8-4-5-9-18(17)31-2)12-11-28(15)14-20-25-22-16-7-6-10-19(32-3)21(16)26-23(24)30(22)27-20/h4-10,15H,11-14H2,1-3H3,(H2,24,26)/t15-/m1/s1
Reactome pathway
8.39E+3n/an/an/an/an/an/an/an/a
Merck Research Laboratories
Curated by ChEMBL
Assay Description
Inhibition of human adenosine A1 receptor
Bioorg Med Chem Lett 25: 2958-62 (2015)
BindingDB Entry DOI: 10.7270/Q23F4RFG
Potassium voltage-gated channel subfamily H member 2
(Homo sapiens (Human))
BDBM50108648
(CHEMBL3596511)
Show SMILES COc1ccccc1N1CCN(Cc2nc3c4cccc(OC)c4nc(N)n3n2)[C@H](C)C1 |r|
Show InChI InChI=1S/C23H27N7O2/c1-15-13-29(17-8-4-5-9-18(17)31-2)12-11-28(15)14-20-25-22-16-7-6-10-19(32-3)21(16)26-23(24)30(22)27-20/h4-10,15H,11-14H2,1-3H3,(H2,24,26)/t15-/m1/s1
Reactome pathway
n/an/a 4.76E+4n/an/an/an/an/an/a
Merck Research Laboratories
Curated by ChEMBL
Assay Description
Inhibition of [35S]MK499 binding to human ERG channel
Bioorg Med Chem Lett 25: 2958-62 (2015)
BindingDB Entry DOI: 10.7270/Q23F4RFG