BDBM50108782 CHEMBL3596639
SMILES: CN(C(=O)c1c(F)cccc1Cl)c1ccc(cc1N1CCCCC1)-c1cc(ccc1Cl)C(N)=O
InChI Key: InChIKey=NFUSQHJZBUXSHD-UHFFFAOYSA-N
Data: 1 IC50  1 EC50
Activity Spreadsheet -- Enzyme Inhibition Constant Data from BindingDB
Found 2 hits for monomerid = 50108782
Trg + Lig
Ki
nM
ΔG°
kcal/mole
IC50
nM
Kd
nM
EC50/IC50
nM
koff
s-1
kon
M-1s-1
pHTemp
°C
Nuclear receptor ROR-gamma
(Homo sapiens (Human))
BDBM50108782
(CHEMBL3596639)
Show SMILES CN(C(=O)c1c(F)cccc1Cl)c1ccc(cc1N1CCCCC1)-c1cc(ccc1Cl)C(N)=O
Show InChI InChI=1S/C26H24Cl2FN3O2/c1-31(26(34)24-20(28)6-5-7-21(24)29)22-11-9-16(15-23(22)32-12-3-2-4-13-32)18-14-17(25(30)33)8-10-19(18)27/h5-11,14-15H,2-4,12-13H2,1H3,(H2,30,33)
n/an/an/an/a 8n/an/an/an/a
Biogen Idec Inc.
Curated by ChEMBL
Assay Description
Inverse agonist activity at Gal4 DNA binding domain-tagged human RORgammat expressed in HEK293T cells assessed as effect on receptor-mediated transcr...
Bioorg Med Chem Lett 25: 2991-7 (2015)
BindingDB Entry DOI: 10.7270/Q2ZP47XQ
Nuclear receptor ROR-gamma
(Homo sapiens (Human))
BDBM50108782
(CHEMBL3596639)
Show SMILES CN(C(=O)c1c(F)cccc1Cl)c1ccc(cc1N1CCCCC1)-c1cc(ccc1Cl)C(N)=O
Show InChI InChI=1S/C26H24Cl2FN3O2/c1-31(26(34)24-20(28)6-5-7-21(24)29)22-11-9-16(15-23(22)32-12-3-2-4-13-32)18-14-17(25(30)33)8-10-19(18)27/h5-11,14-15H,2-4,12-13H2,1H3,(H2,30,33)
n/an/a 3n/an/an/an/an/an/a
Biogen Idec Inc.
Curated by ChEMBL
Assay Description
Inverse agonist activity at human recombinant GST-tagged RORgammat ligand binding domain assessed as effect on receptor-biotin tagged TRAP220 co-acti...
Bioorg Med Chem Lett 25: 2991-7 (2015)
BindingDB Entry DOI: 10.7270/Q2ZP47XQ