BDBM50108990 CHEMBL3600551
SMILES: CC1=CC2CC(C1)c1c(C2)nc2cc(Cl)ccc2c1NCCCCCCCCCCCCNc1c2CCCCc2nc2ccccc12
InChI Key: InChIKey=VBPYUDBSLYCEMA-UHFFFAOYSA-N
Data: 1 IC50
Activity Spreadsheet -- Enzyme Inhibition Constant Data from BindingDB
Found 1 hit for monomerid = 50108990
Trg + Lig
Ki
nM
ΔG°
kcal/mole
IC50
nM
Kd
nM
EC50/IC50
nM
koff
s-1
kon
M-1s-1
pHTemp
°C
Acetylcholinesterase
(Homo sapiens (Human))
BDBM50108990
(CHEMBL3600551)
Show SMILES CC1=CC2CC(C1)c1c(C2)nc2cc(Cl)ccc2c1NCCCCCCCCCCCCNc1c2CCCCc2nc2ccccc12 |t:1|
Show InChI InChI=1S/C42H53ClN4/c1-29-24-30-26-31(25-29)40-39(27-30)47-38-28-32(43)20-21-35(38)42(40)45-23-15-9-7-5-3-2-4-6-8-14-22-44-41-33-16-10-12-18-36(33)46-37-19-13-11-17-34(37)41/h10,12,16,18,20-21,24,28,30-31H,2-9,11,13-15,17,19,22-23,25-27H2,1H3,(H,44,46)(H,45,47)
NCI pathway
Reactome pathway
n/an/a 1.90n/an/an/an/an/an/a
Universitat de Barcelona
Curated by ChEMBL
Assay Description
Inhibition of human recombinant AChE using acetylthiocholine iodide as substrate preincubated with enzyme for 20 mins prior to substrate addition by ...
Bioorg Med Chem 23: 5156-67 (2015)
BindingDB Entry DOI: 10.7270/Q2XS5X57