BDBM50109366 CHEMBL3601210
SMILES: OC(=O)CN(c1ccc(N(CC(O)=O)S(=O)(=O)c2ccc(Cl)cc2)c2ccccc12)S(=O)(=O)c1ccc(Cl)cc1
InChI Key: InChIKey=XEACSCDYNLDUDF-UHFFFAOYSA-N
Data: 1 IC50
Activity Spreadsheet -- Enzyme Inhibition Constant Data from BindingDB
Found 1 hit for monomerid = 50109366
Trg + Lig
Ki
nM
ΔG°
kcal/mole
IC50
nM
Kd
nM
EC50/IC50
nM
koff
s-1
kon
M-1s-1
pHTemp
°C
Nuclear factor erythroid 2-related factor 2
(Homo sapiens (Human))
BDBM50109366
(CHEMBL3601210)
Show SMILES OC(=O)CN(c1ccc(N(CC(O)=O)S(=O)(=O)c2ccc(Cl)cc2)c2ccccc12)S(=O)(=O)c1ccc(Cl)cc1
Show InChI InChI=1S/C26H20Cl2N2O8S2/c27-17-5-9-19(10-6-17)39(35,36)29(15-25(31)32)23-13-14-24(22-4-2-1-3-21(22)23)30(16-26(33)34)40(37,38)20-11-7-18(28)8-12-20/h1-14H,15-16H2,(H,31,32)(H,33,34)
n/an/a 42n/an/an/an/an/an/a
China Pharmaceutical University
Curated by ChEMBL
Assay Description
Inhibition of Keap1 Kelch domain-Nrf2 ETGE (unknown origin) protein-protein interaction incubated for 30 mins by fluorescence polarization competitio...
J Med Chem 58: 6410-21 (2015)
BindingDB Entry DOI: 10.7270/Q2CR5W5H