BDBM50109369 CHEMBL3601213
SMILES: CC(C)(C)c1ccc(cc1)S(=O)(=O)N(CC(O)=O)c1ccc(N(CC(O)=O)S(=O)(=O)c2ccc(cc2)C(C)(C)C)c2ccccc12
InChI Key: InChIKey=LPKUZUTXBLBZSN-UHFFFAOYSA-N
Data: 1 IC50
Activity Spreadsheet -- Enzyme Inhibition Constant Data from BindingDB
Found 1 hit for monomerid = 50109369
Trg + Lig
Ki
nM
ΔG°
kcal/mole
IC50
nM
Kd
nM
EC50/IC50
nM
koff
s-1
kon
M-1s-1
pHTemp
°C
Nuclear factor erythroid 2-related factor 2
(Homo sapiens (Human))
BDBM50109369
(CHEMBL3601213)
Show SMILES CC(C)(C)c1ccc(cc1)S(=O)(=O)N(CC(O)=O)c1ccc(N(CC(O)=O)S(=O)(=O)c2ccc(cc2)C(C)(C)C)c2ccccc12
Show InChI InChI=1S/C34H38N2O8S2/c1-33(2,3)23-11-15-25(16-12-23)45(41,42)35(21-31(37)38)29-19-20-30(28-10-8-7-9-27(28)29)36(22-32(39)40)46(43,44)26-17-13-24(14-18-26)34(4,5)6/h7-20H,21-22H2,1-6H3,(H,37,38)(H,39,40)
n/an/a 50n/an/an/an/an/an/a
China Pharmaceutical University
Curated by ChEMBL
Assay Description
Inhibition of Keap1 Kelch domain-Nrf2 ETGE (unknown origin) protein-protein interaction incubated for 30 mins by fluorescence polarization competitio...
J Med Chem 58: 6410-21 (2015)
BindingDB Entry DOI: 10.7270/Q2CR5W5H