BDBM50109371 CHEMBL3601215
SMILES: OC(=O)CN(c1ccc(N(CC(O)=O)S(=O)(=O)c2ccccc2)c2ccccc12)S(=O)(=O)c1ccccc1
InChI Key: InChIKey=SNLIUNXULFSSAY-UHFFFAOYSA-N
Data: 1 IC50
Activity Spreadsheet -- Enzyme Inhibition Constant Data from BindingDB
Found 1 hit for monomerid = 50109371
Trg + Lig
Ki
nM
ΔG°
kcal/mole
IC50
nM
Kd
nM
EC50/IC50
nM
koff
s-1
kon
M-1s-1
pHTemp
°C
Nuclear factor erythroid 2-related factor 2
(Homo sapiens (Human))
BDBM50109371
(CHEMBL3601215)
Show SMILES OC(=O)CN(c1ccc(N(CC(O)=O)S(=O)(=O)c2ccccc2)c2ccccc12)S(=O)(=O)c1ccccc1
Show InChI InChI=1S/C26H22N2O8S2/c29-25(30)17-27(37(33,34)19-9-3-1-4-10-19)23-15-16-24(22-14-8-7-13-21(22)23)28(18-26(31)32)38(35,36)20-11-5-2-6-12-20/h1-16H,17-18H2,(H,29,30)(H,31,32)
n/an/a 34n/an/an/an/an/an/a
China Pharmaceutical University
Curated by ChEMBL
Assay Description
Inhibition of Keap1 Kelch domain-Nrf2 ETGE (unknown origin) protein-protein interaction incubated for 30 mins by fluorescence polarization competitio...
J Med Chem 58: 6410-21 (2015)
BindingDB Entry DOI: 10.7270/Q2CR5W5H