BDBM50109431 CHEMBL3601113
SMILES: CN(C)CCn1cc(Nc2ncc(Cl)c(NCc3cccc(NC(=O)C=C)c3)n2)cn1
InChI Key: InChIKey=JBPHJFDIOAJJIB-UHFFFAOYSA-N
Data: 1 IC50
Activity Spreadsheet -- Enzyme Inhibition Constant Data from BindingDB
Found 1 hit for monomerid = 50109431
Trg + Lig
Ki
nM
ΔG°
kcal/mole
IC50
nM
Kd
nM
EC50/IC50
nM
koff
s-1
kon
M-1s-1
pHTemp
°C
Tyrosine-protein kinase JAK3
(Homo sapiens (Human))
BDBM50109431
(CHEMBL3601113)
Show SMILES CN(C)CCn1cc(Nc2ncc(Cl)c(NCc3cccc(NC(=O)C=C)c3)n2)cn1
Show InChI InChI=1S/C21H25ClN8O/c1-4-19(31)26-16-7-5-6-15(10-16)11-23-20-18(22)13-24-21(28-20)27-17-12-25-30(14-17)9-8-29(2)3/h4-7,10,12-14H,1,8-9,11H2,2-3H3,(H,26,31)(H2,23,24,27,28)
Reactome pathway
n/an/a<0.5n/an/an/an/an/an/a
Harvard Medical School
Curated by ChEMBL
Assay Description
Inhibition of JAK3 (unknown origin) by Z'-Lyte assay
J Med Chem 58: 6589-606 (2015)
BindingDB Entry DOI: 10.7270/Q2833TSH